{"text_format":"1","workbook":"xlsx","n_sheets":15,"sheets":["Landing Page","Instructions","Interpretation","User Parameters","Results Dashboard","Graphs","COC Calculation","Net Income Matrix","RBC Weights","Tax Rates","Drop Downs","Curve Selection Drop Down","Cost of Capital Data","Change Documentation","Macro Populated Cells"],"not_rendered":{"charts":5,"images":0,"macros":1,"external_links":0,"defined_names":158,"comments":3,"pivot_tables":0},"unopened":[],"bounds":{"document_bytes":16777216,"sheet_cells":100000,"rows_first":2000,"rows_last":500,"rows_between":2000,"halvings":0,"cell_chars":16384,"cell_head_chars":4096},"cells_cut":0,"cells_raw":0,"read":"whole","date_system":"1900"}

{"sheet":"Landing Page","index":0,"n_rows":30,"n_cols":3,"rows_kept":30,"cut":false,"hidden":false,"merged":[[10,0,10,2],[29,0,29,2],[0,0,0,2],[1,0,1,2],[2,0,2,2],[5,0,5,2],[6,0,6,2],[8,0,8,2],[7,0,7,2]]}
["Society of Actuaries"]
["Underwriting Margin Model (v.2024)"]
["For Medicaid Managed Care Rate Development"]
[]
["Disclosures and Limitations"]
["This Excel model accompanies the report titled Medicaid Managed Care Underwriting Margin Model. They are intended to be used in their entirety by qualified actuaries setting rates or evaluating rates for Medicaid managed care programs to develop the underwriting margin component of the capitation rates. It should not be relied on for any other purpose. The calculations in the Excel model as well as the methodologies and assumptions discussed in the report are not intended to account for all possible scenarios. Users should use actuarial judgment to determine if the model results are appropriate for the specific circumstances of the program being evaluated. Actual underwriting margin results will vary from the model estimates."]
["The model relies upon historical Medicaid managed care organization statutory financial filings with the National Association of Insurance Commissioners (NAIC). The authors reviewed the data for reasonableness but did not perform an audit of the data."]
["The opinions expressed and conclusions reached by the authors are their own and do not represent any official position or opinion of the Society of Actuaries or its members. The Society of Actuaries makes no representation or warranty to the accuracy of the information."]
{"$rows_left_out":23}
{"sheet":"Instructions","index":1,"n_rows":86,"n_cols":3,"rows_kept":86,"cut":false,"hidden":false,"merged":[[85,0,85,2],[0,0,0,2],[20,0,20,2],[18,0,18,2],[84,0,84,2],[83,0,83,2],[2,0,2,2],[16,0,16,2],[19,0,19,2]]}
["Instructions for the UW Margin Model"]
[]
["The purpose of the model is to help the actuary decide what Underwriting Margin should be used in the premium rate development by enabling the actuary to test the sensitivity of assumptions."]
[]
["I.      Set assumptions for:"]
["*  General Parameters"]
["*  Cost of Capital Parameters"]
["*  Underwriting Margin Curve Activation"]
{"$rows_left_out":79}
{"sheet":"Interpretation","index":2,"n_rows":66,"n_cols":1,"rows_kept":66,"cut":false,"hidden":false,"merged":[]}
["Interpretation of Results Dashboard"]
[]
["     Selected Target Table"]
[]
["This table shows which of the three types of targets (Net Income, Risk Margin or Probability of Ruin) was selected on the User Parameter tab. The model determines the risk margin necessary to achieve the target outcome. The table compares the target percentage to the result generated by the model and provides the variance."]
["• In most cases the variance will be zero. This will not typically be true when a Probability of Ruin target is selected. The result will be close to the target, but the actuary may be able to minimize the variance by trying small changes to the risk margin."]
[]
["Note the Risk Margin target type is provided for convenience. A user would select this type to test a known margin amount as opposed to trying to achieve a Net Income target or a Probability of Ruin target."]
{"$rows_left_out":59}
{"sheet":"User Parameters","index":3,"n_rows":51,"n_cols":11,"rows_kept":51,"cut":false,"hidden":false,"merged":[[47,0,47,2],[34,4,34,9],[24,4,24,7],[23,4,23,9],[16,0,16,2],[0,1,0,2],[2,0,2,2],[0,6,0,7],[9,4,9,9],[2,4,2,9]]}
["SOA Underwriting Margin Model: USER PARAMETERS","Calculation Is Required",null,null,null,null,"Worksheet Locked"]
[]
["General Parameters",null,null,null,"MLR Provisions"]
[" 1. Calculation Target","Net Income Before Taxes",0.02,"i","38. Include Minimum MLR, Maximum MLR Provisions on Rates",null,null,null,null,"No","i"]
[" 2. Average Monthly Enrollment",null,125000,"i","38.a. Minimum MLR",null,null,null,null,0.9]
[" 3. Months in Rating Period",null,12,"i","38.b. Maximum MLR",null,null,null,null,2]
[" 4. Member Months",null,{"$f":"C5*C6","v":1500000},"i"]
[" 5a. UW Margin Curve: Include Pandemic Period [CY 2020–CY 2022] in Curve Development?",null,"Yes","i"]
{"$rows_left_out":44}
{"sheet":"Results Dashboard","index":4,"n_rows":61,"n_cols":21,"rows_kept":61,"cut":false,"hidden":false,"merged":[[47,14,47,15],[46,14,46,18],[11,14,11,15],[12,14,12,15],[13,14,13,15],[14,14,14,15],[31,0,31,1],[44,0,44,4],[48,0,48,1],[3,0,3,2],[5,0,5,2],[6,0,6,1],[11,4,11,12],[19,0,19,3],[20,0,20,1],[12,0,12,2],[12,4,12,12],[60,0,60,1],[0,4,0,6],[7,14,7,15],[8,14,8,15],[9,14,9,15],[10,14,10,15],[4,4,4,12],[4,14,4,18],[6,14,6,15],[5,4,5,5],[5,14,5,15],[48,3,48,4],[48,5,48,6],[48,7,48,8],[30,0,30,4],[47,0,47,8]]}
["SOA Underwriting Margin Model: RESULTS DASHBOARD",null,null,null,"Calculation Is Required",null,null,"i"]
[]
[]
[{"$f":"\"Results Based on \" & 'User Parameters'!B9","v":"Results Based on Composite 2016 to 2019 Curve"},null,null,"i"]
[null,null,null,null,"Probability of Ruin by RBC Level",null,null,null,null,null,null,null,null,"i","Gain and Loss Distribution",null,null,null,null,"i"]
[{"$f":"\"Selected Target: \"&UP_Target_Type","v":"Selected Target: Net Income Before Taxes"},null,null,"i","RBC Thresholds",null,"RBC %","RBC $M","RBC PMPM","RBC as a % of Premium","Probability of Exceeding the  RBC Threshold","Value of Excess Losses as % of Premium","Given a loss, the average loss ($M) in excess of the  RBC level",null,"Interval",null,"Starting Point","Gain Likelihood","Loss Likelihood"]
["Results",null,{"$f":"IF(UP_Target_Type=\"Probability of Ruin\",\"Probability\",\" % of Premium\")","v":" % of Premium"},null,"Authorized Control Level (ACL)",null,1,{"$f":"I7*'User Parameters'!$C$7","v":30634601.97072288},{"$f":"ACL","v":20.423067980481921},{"$f":"I7/$R$50","v":3.2191571853645122E-2},{"$f":"SUMIF('Net Income Matrix'!$AA$8:$AA$168,\"<= \" & -J7,'Net Income Matrix'!$AD$8:$AD$168)","v":1.6784228434145888E-2},{"$f":"-'Net Income Matrix'!AF5","v":2.3293789977818383E-4},{"$f":"IF(K7=0,0,L7*UP_Enrollment*12*'Results Dashboard'!$R$50/K7)","v":13207141.559675431},"i","0 –2%",null,0,{"$f":"SUMIFS('Net Income Matrix'!$AD$8:$AD$168,'Net Income Matrix'!$AA$8:$AA$168,\">=\" & Q7)-SUMIFS('Net Income Matrix'!$AD$8:$AD$168,'Net Income Matrix'!$AA$8:$AA$168,\">\" &Q8)","v":0.15693782924555577},{"$f":"SUMIFS('Net Income Matrix'!$AD$8:$AD$168,'Net Income Matrix'!$AA$8:$AA$168,\"<=\" & -Q7)-SUMIFS('Net Income Matrix'!$AD$8:$AD$168,'Net Income Matrix'!$AA$8:$AA$168,\"<\" & -Q8)","v":8.3963697694235645E-2}]
["Target",null,{"$f":"'User Parameters'!C4","v":0.02},null,"200% of ACL",null,2,{"$f":"I8*'User Parameters'!$C$7","v":61269203.94144576},{"$f":"G8*I7","v":40.846135960963842},{"$f":"I8/$R$50","v":6.4383143707290244E-2},{"$f":"SUMIF('Net Income Matrix'!$AA$8:$AA$168,\"<= \" & -J8,'Net Income Matrix'!$AD$8:$AD$168)","v":1.4634883213441204E-3},{"$f":"-'Net Income Matrix'!AG5","v":1.3321909506584009E-5},{"$f":"IF(K8=0,0,L8*UP_Enrollment*12*'Results Dashboard'!$R$50/K8)","v":8662580.3740856554},null,"2–4%",null,0.02,{"$f":"SUMIFS('Net Income Matrix'!$AD$8:$AD$168,'Net Income Matrix'!$AA$8:$AA$168,\">=\" & Q8)-SUMIFS('Net Income Matrix'!$AD$8:$AD$168,'Net Income Matrix'!$AA$8:$AA$168,\">\" &Q9)","v":0.71454938287656511},{"$f":"SUMIFS('Net Income Matrix'!$AD$8:$AD$168,'Net Income Matrix'!$AA$8:$AA$168,\"<=\" & -Q8)-SUMIFS('Net Income Matrix'!$AD$8:$AD$168,'Net Income Matrix'!$AA$8:$AA$168,\"<\" & -Q9)","v":3.2850886361290854E-2}]
{"$rows_left_out":54}
{"sheet":"Graphs","index":5,"n_rows":54,"n_cols":9,"rows_kept":54,"cut":false,"hidden":false,"merged":[[19,1,19,4],[4,1,4,4],[44,1,44,4],[45,1,45,2],[46,1,46,2],[49,1,49,2],[48,1,48,2],[50,1,50,2],[51,1,51,2],[20,1,20,2],[47,1,47,2]]}
[]
[]
[]
[]
[null,"Probability of Ruin by Risk-Based Capital (RBC) Level"]
[null,"RBC Thresholds","RBC %","RBC as a % of Premium","Probability > RBC"]
[null,{"$f":"'Results Dashboard'!E7","v":"Authorized Control Level (ACL)"},{"$f":"'Results Dashboard'!G7","v":1},{"$f":"'Results Dashboard'!J7","v":3.2191571853645122E-2},{"$f":"'Results Dashboard'!K7","v":1.6784228434145888E-2}]
[null,{"$f":"'Results Dashboard'!E8","v":"200% of ACL"},{"$f":"'Results Dashboard'!G8","v":2},{"$f":"'Results Dashboard'!J8","v":6.4383143707290244E-2},{"$f":"'Results Dashboard'!K8","v":1.4634883213441204E-3}]
{"$rows_left_out":47}
{"sheet":"COC Calculation","index":6,"n_rows":115,"n_cols":44,"rows_kept":115,"cut":false,"hidden":false,"merged":[[0,0,0,5],[45,0,45,5],[70,0,70,5],[80,0,80,5],[86,0,86,5],[1,0,1,5],[112,0,112,5],[8,0,8,5],[12,0,12,5],[20,0,20,5],[28,0,28,5],[48,0,48,5],[53,0,53,5],[66,0,66,5],[87,0,87,5],[99,0,99,5],[105,0,105,5],[11,0,11,5],[39,0,39,5],[42,0,42,5]]}
["Cost of Capital Calculation"]
["Shared Inputs:"]
["Member Months",null,{"$f":"UP_Enrollment*UP_MonthsInRatingPeriod","v":1500000},null,{"$f":"_xlfn.FORMULATEXT(C3)","v":"=UP_Enrollment*UP_MonthsInRatingPeriod"},"user parameter: Average Monthly Enrollment × Months in Rating Period"]
["Base Medical PMPM",null,{"$f":"UP_Medical_PMPM","v":550},null,"=UP_Medical_PMPM","user parameter: Medical Component PMPM"]
["Base Administrative PMPM",null,{"$f":"UP_Administrative_PMPM","v":50},null,"=UP_Administrative_PMPM","user parameter: Administrative Component PMPM (excl. UW margin or taxes)"]
["Base Premium PMPM (before taxes)",null,{"$f":"Results_Premium","v":634.42282574248929},null,"=Results_Premium","calculated: Base PMPM"]
["Gross Claims",null,{"$f":"C3*C4","v":825000000},null,{"$f":"_xlfn.FORMULATEXT(C7)","v":"=C3*C4"}]
["Gross Premium",null,{"$f":"C3*C6","v":951634238.61373389},null,{"$f":"_xlfn.FORMULATEXT(C8)","v":"=C3*C6"}]
{"$rows_left_out":108}
{"sheet":"Net Income Matrix","index":7,"n_rows":168,"n_cols":40,"rows_kept":168,"cut":false,"hidden":false,"merged":[[5,31,5,35],[5,1,5,3],[5,4,5,7],[5,27,5,29],[5,23,5,26],[5,19,5,22],[5,10,5,16]]}
["Net Income Matrix",null,null,null,null,null,null,null,null,null,"Risk Corridors:","I","II","III","IV","V","VI",null,null,null,null,null,null,null,null,null,null,null,{"$f":"'User Parameters'!B9","v":"Composite 2016 to 2019 Curve"}]
[null,null,null,null,null,null,null,null,null,null,"Lower Threshold",{"$f":"IF(UP_RSBasis=\"No Risk Share\",0,'User Parameters'!F14)","v":0},{"$f":"L3","v":0},{"$f":"M3","v":0},{"$f":"N3","v":0},{"$f":"O3","v":0},{"$f":"P3","v":0},null,null,null,null,null,null,null,null,null,null,"Mean of Underwriting Margin",null,{"$f":"H88","v":4.4258491885443972E-2}]
[null,null,null,null,null,null,null,null,null,null,"Upper Threshold",{"$f":"IF(UP_RSBasis=\"No Risk Share\",0,'User Parameters'!H14)","v":0},{"$f":"IF(UP_RSBasis=\"No Risk Share\",0,'User Parameters'!H15)","v":0},{"$f":"IF(UP_RSBasis=\"No Risk Share\",0,'User Parameters'!H16)","v":0},{"$f":"IF(UP_RSBasis=\"No Risk Share\",0,'User Parameters'!H17)","v":0},{"$f":"IF(UP_RSBasis=\"No Risk Share\",0,'User Parameters'!H18)","v":0},{"$f":"IF(UP_RSBasis=\"No Risk Share\",0,'User Parameters'!H19)","v":0},null,null,null,null,null,null,null,null,null,null,"Standard Deviation",null,{"$f":"'User Parameters'!C9","v":3.5290503251745854E-2}]
[null,null,null,null,null,null,null,null,null,null,"State Share",{"$f":"IF(UP_RSBasis=\"No Risk Share\",0,1-'User Parameters'!I14)","v":0},{"$f":"IF(UP_RSBasis=\"No Risk Share\",0,1-'User Parameters'!I15)","v":0},{"$f":"IF(UP_RSBasis=\"No Risk Share\",0,1-'User Parameters'!I16)","v":0},{"$f":"IF(UP_RSBasis=\"No Risk Share\",0,1-'User Parameters'!I17)","v":0},{"$f":"IF(UP_RSBasis=\"No Risk Share\",0,1-'User Parameters'!I18)","v":0},{"$f":"IF(UP_RSBasis=\"No Risk Share\",0,1-'User Parameters'!I19)","v":0},null,null,null,null,null,null,null,null,null,null,null,null,null,null,null,null,null,null,null,null,"Excluding lag in CoC infusions"]
["Average/Total",{"$f":"SUMPRODUCT(B$8:B$168,$AD$8:$AD$168)","v":634.42282574248895},550.00000000000011,0.86692971577167666,50.000000000000014,6.3442282574248914,28.078597485064201,4.4258491885443674E-2,0.87568658158755264,0,0,{"$f":"SUMPRODUCT(L$8:L$168,$AD$8:$AD$168)","v":0},0,0,0,0,0,{"$f":"SUMPRODUCT(R$8:R$168,$AD$8:$AD$168)","v":0},0,0.87568658158755264,0.90591209898405045,18.984000574652729,2.9923262222532786E-2,1.4335229662910877E-2,0,0,{"$f":"SUMPRODUCT(AA$8:AA$168,$AD$8:$AD$168)","v":1.4335229662910877E-2},null,{"$f":"SUM(AC$8:AC$168)","v":0.99999999999999878},{"$f":"SUM(AD$8:AD$168)","v":1},null,{"$f":"SUMPRODUCT(AF$8:AF$168,$AD$8:$AD$168)","v":-2.3293789977818383E-4},{"$f":"SUMPRODUCT(AG$8:AG$168,$AD$8:$AD$168)","v":-1.3321909506584009E-5},{"$f":"SUMPRODUCT(AH$8:AH$168,$AD$8:$AD$168)","v":-2.3736325793204098E-6},{"$f":"SUMPRODUCT(AI$8:AI$168,$AD$8:$AD$168)","v":-3.9745314671061804E-10},{"$f":"SUMPRODUCT(AJ$8:AJ$168,$AD$8:$AD$168)","v":-3.9745314671061804E-10},null,{"$f":"SUMPRODUCT(AL$8:AL$168,$AD$8:$AD$168)","v":0},0,{"$f":"SUMPRODUCT(AN$8:AN$168,$AD$8:$AD$168)","v":1.4335229662910877E-2}]
["Bin","Claims Calculation",null,null,"Underwriting Margin Calculation",null,null,null,"MLR","Risk Share Target","Risk Corridor Calculations",null,null,null,null,null,null,null,null,"MLR Limit Calculation",null,null,null,"Net Income Calculation",null,null,null,"Normal Curve",null,null,null,"Probability of Ruin Results"]
["Loss Ratio","Premium PMPM","Claims PMPM","Initial MLR","Admin","Premium Tax","Underwriting Margin","Underwriting Margin Ratio","Alternative:\nFor Purposes of Risk Share Use MLR (as Used for MLR Limit) Not Loss Ratio",{"$f":"IF(UP_RSBasis=\"MLR\",\"Risk Share Target %\",IF(UP_RSBasis=\"Medical Baseline\",\"Claims PMPM\",\"N/A\"))","v":"N/A"},{"$f":"IF(UP_RSBasis=\"MLR\",\"MLR Gain/(Loss)\",IF(UP_RSBasis=\"Medical Baseline\",\"Medical Gain/(Loss)\",\"\"))","v":""},"Corridor I","Corridor II","Corridor III","Corridor IV","Corridor V","Corridor VI",{"$f":"IF(UP_RSBasis=\"MLR\",\"MLR Adjustment\",\"\")","v":""},"Claims Adjustment","Adjusted MLR","Capped MLR","Net Transfer Payment ","Net Transfer Payment as a % of Premium","Gain/Loss as a % of Premium","Cost of Capital Infusion on Gains/Losses before Transfer Payments (as a % of Premium)","Withhold Unachieved as a % of Premium","Net Income as a % of Premium","Density Function","Probability","Adjusted Probability","Adjusted Probability Only for the Dashboard Graph","Authorized Control Level (ACL)","200% of ACL","Minimum Threshold",{"$f":"\"Target  (Discount = \"&UP_COC_RBCThresholdDiscount*100&\"%)\"","v":"Target  (Discount = 0%)"},"Maximum Threshold"]
[{"$f":"A9-0.005","v":0.46692971577167597},{"$f":"$B$88","v":634.42282574248929},{"$f":"B8*A8","v":296.23086970300403},{"$f":"(C8)/(B8)","v":0.46692971577167597},{"$f":"'User Parameters'!$C$11","v":50},{"$f":"B8*'User Parameters'!$C$15","v":6.3442282574248932},{"$f":"B8-E8-C8-F8","v":281.84772778206036},{"$f":"G8/B8","v":0.44425849188544436},{"$f":"($C8+UP_QIPMPM)/($B8-$F8)","v":0.47164617754714744},{"$f":"IF(UP_RSBasis=\"MLR\",UP_RSTarget_MLR,IF(UP_RSBasis=\"Medical Baseline\",UP_RSTarget_Medlcal,0))","v":0},{"$f":"IF(UP_RSBasis=\"MLR\",J8-I8,IF(UP_RSBasis=\"Medical Baseline\",J8-$C8,0))","v":0},{"$f":"IF($K8>0,MIN(J8*L$3-J8*L$2,$K8-M8-N8),0)","v":0},{"$f":"IF($K8>0,MIN(J8*M$3-J8*M$2,$K8-N8),0)","v":0},{"$f":"IF($K8>0,MIN(J8*N$3-J8*N$2,$K8),0)","v":0},{"$f":"IF($K8<0,MAX(J8*O$2-J8*O$3,$K8),0)","v":0},{"$f":"IF($K8<0,MAX(J8*P$2-J8*P$3,$K8-O8),0)","v":0},{"$f":"IF($K8<0,MAX(J8*Q$2-J8*Q$3,$K8-P8-O8),0)","v":0},{"$f":"IF(UP_RSBasis=\"MLR\",SUMPRODUCT(L$4:Q$4,L8:Q8),\"\")","v":""},{"$f":"IF(UP_RSBasis=\"MLR\",R8*(B8-F8),SUMPRODUCT($L$4:$Q$4,$L8:$Q8))","v":0},{"$f":"(S8+C8+'User Parameters'!$C$12)/(B8-F8)","v":0.47164617754714744},{"$f":"IF(T8<'User Parameters'!$J$5,'User Parameters'!$J$5,IF(T8>'User Parameters'!$J$6,'User Parameters'!$J$6,T8))","v":0.9},{"$f":"(U8-T8)*(B8-F8)","v":269.03986803355394},{"$f":"V8/B8","v":0.42407028422832405},{"$f":"(B8-C8-F8-E8-S8-V8)/'Results Dashboard'!$D$43","v":2.0188207657120295E-2},{"$f":"IF((X8+W8)>0,(X8+W8)*0.5*((1+'User Parameters'!C$50)^((12+UP_COC_WithholdLag)/12)-1),(X8+W8)*0.5*((1+'User Parameters'!$C$51)^((12+UP_COC_WithholdLag)/12)-1))","v":0},{"$f":"-'User Parameters'!$C$13*('User Parameters'!$C$14-1)","v":0},{"$f":"Y8+X8-Z8","v":2.0188207657120295E-2},{"$f":"_xlfn.NORM.DIST(H8,$AD$2,$AD$3,TRUE)","v":1},{"$f":"AB8-AB9","v":0},{"$f":"AC8+(1-AC5)/2","v":6.106226635438361E-16},{"$f":"AD8","v":6.106226635438361E-16},{"$f":"IF($AA8<-'Results Dashboard'!$J$7,$AA8+'Results Dashboard'!$J$7,0)","v":0},{"$f":"IF($AA8<-'Results Dashboard'!$J$8,$AA8+'Results Dashboard'!$J$8,0)","v":0},{"$f":"IF($AA8<-'Results Dashboard'!$J$9,$AA8+'Results Dashboard'!$J$9,0)","v":0},{"$f":"IF($AA8<-'Results Dashboard'!$J$11,$AA8+'Results Dashboard'!$J$11,0)","v":0},{"$f":"IF($AA8<-'Results Dashboard'!$J$10,$AA8+'Results Dashboard'!$J$10,0)","v":0},null,{"$f":"IF((X8+W8)>0,(X8+W8)*0.5*'User Parameters'!C$50,(X8+W8)*0.5*'User Parameters'!$C$51)","v":0},{"$f":"-'User Parameters'!$C$13*('User Parameters'!$C$14-1)","v":0},{"$f":"-AL8+X8-AM8","v":2.0188207657120295E-2}]
{"$rows_left_out":161}
{"sheet":"RBC Weights","index":8,"n_rows":62,"n_cols":11,"rows_kept":62,"cut":false,"hidden":true,"merged":[[20,1,20,6],[20,8,20,10],[15,0,15,2]]}
["Calculation of Relative Weights of RBC Risk Factors"]
[]
["Selection Criteria:",{"$f":"UP_COC_Selection_H4","v":"Medicaid-Dominant"}]
[]
["Relative Contribution to ACL:","SELECTED","ALL FILINGS","MEDICAID-DOMINANT FILINGS"]
["H0",{"$f":"IF($B$3=\"Medicaid-Dominant\",D6,C6)","v":2.5336962234345423E-2},{"$f":"B32","v":0.1127281279261159},{"$f":"I32","v":2.5336962234345423E-2}]
["H1^2",{"$f":"IF($B$3=\"Medicaid-Dominant\",D7,C7)","v":8.4931946684462842E-2},{"$f":"B33","v":0.22199950203609375},{"$f":"I33","v":8.4931946684462842E-2}]
["H2^2",{"$f":"IF($B$3=\"Medicaid-Dominant\",D8,C8)","v":1},{"$f":"B34","v":1},{"$f":"I34","v":1}]
{"$rows_left_out":55}
{"sheet":"Tax Rates","index":9,"n_rows":69,"n_cols":11,"rows_kept":69,"cut":false,"hidden":true,"merged":[[66,0,66,5],[66,6,66,10],[67,0,67,5],[67,6,67,10],[68,0,68,5],[68,6,68,10],[63,0,63,5],[63,6,63,10],[64,0,64,5],[64,6,64,10],[65,0,65,5],[65,6,65,10],[2,1,2,4],[2,7,2,10],[61,0,61,5],[61,6,61,10],[62,0,62,5],[62,6,62,10]]}
["State Corporate Tax Rates"]
[]
["Source:","Tax Foundation. \"State Corporate Income Tax Rates and Brackets for 2021\" Internet: https://taxfoundation.org/state-corporate-tax-rates-2021/",null,null,null,null,"Source:","Tax Foundation. \"State Corporate Income Tax Rates and Brackets for 2024\" Internet: https://taxfoundation.org/data/all/state/state-corporate-income-tax-rates-brackets-2024/"]
[]
["Period",2021,null,null,null,null,"Period",2024]
[]
["STATE","Rate (%)","Federal Tax Deduction","Top Bracket","Note",null,"STATE","Rate (%)","Federal Tax Deduction","Top Bracket","Note"]
["Alabama",6.5000000000000002E-2,1,0,null,null,"Alabama",6.5000000000000002E-2]
{"$rows_left_out":62}
{"sheet":"Drop Downs","index":10,"n_rows":124,"n_cols":5,"rows_kept":124,"cut":false,"hidden":true,"merged":[]}
[]
["Yes/No Toggle"]
["Yes"]
["No"]
[]
["Risk Based Capital (RBC) % Thresholds"]
["25th Percentile",{"$f":"ROUND(_xlfn.XLOOKUP(\"RBC %\"&\"5-Year\",data_coc[METRIC]&data_coc[Period],data_coc[25th Percentile],0),2)","v":3.56}]
["50th Percentile",{"$f":"ROUND(_xlfn.XLOOKUP(\"RBC %\"&\"5-Year\",data_coc[METRIC]&data_coc[Period],data_coc[50th Percentile],0),2)","v":4.59}]
{"$rows_left_out":117}
{"sheet":"Curve Selection Drop Down","index":11,"n_rows":26,"n_cols":11,"rows_kept":26,"cut":false,"hidden":true,"merged":[[2,5,2,6],[2,7,2,8],[2,9,2,10],[3,2,3,3]]}
[]
["UW Margin Adjusted Standard Deviations"]
[null,null,null,null,null,"Risk Margin",null,"Probability of Ruin",null,"Likelihood of Loss"]
["Include Pandemic Years in Curve?","Y/N","Curves",null,"Stand Dev.","% of Prem.","High/ Low","%","High/ Low","%","High/ Low"]
[]
[1,"Y","Composite 2013 to 2022 Curve",null,3.6157817692235202E-2,9.999389648437499E-3,{"$f":"IF(F6=MIN($F$6:$F$16),\"Low\",IF(F6=MAX($F$6:$F$16),\"High\",\"\"))","v":"Low"},2.5174470245714712E-6,{"$f":"IF(H6=MIN($H$6:$H$16),\"Low\",IF(H6=MAX($H$6:$H$16),\"High\",\"\"))","v":""},0.29008694866924578,{"$f":"IF(J6=MIN($J$5:$J$16),\"Low\",IF(J6=MAX($J$5:$J$16),\"High\",\"\"))","v":""}]
[2,"Y","Composite 2013 to 2019 Curve",null,3.7144889249174973E-2,9.999389648437499E-3,"Low",4.454988633962101E-6,{"$f":"IF(H7=MIN($H$6:$H$16),\"Low\",IF(H7=MAX($H$6:$H$16),\"High\",\"\"))","v":""},0.29513939178846954,{"$f":"IF(J7=MIN($J$5:$J$16),\"Low\",IF(J7=MAX($J$5:$J$16),\"High\",\"\"))","v":""}]
[3,"Y","Composite 2013 to 2015 Curve",null,3.8920096212363517E-2,9.999389648437499E-3,"Low",1.1203150610040934E-5,"",0.30367027247816308,""]
{"$rows_left_out":19}
{"sheet":"Cost of Capital Data","index":12,"n_rows":65,"n_cols":17,"rows_kept":65,"cut":false,"hidden":true,"merged":[]}
[]
["Selected Time Period"]
[null,"Time Period","Metric"]
["Risk Free Rate",{"$f":"UP_COC_Selection_RiskFreeTimePeriod","v":"1-Year"},{"$f":"UP_COC_Selection_RiskFreeRate","v":"10-Yr Treasury"}]
["Equity Rate",{"$f":"UP_COC_Selection_EquityTimePeriod","v":"3-Year"},{"$f":"UP_COC_Selection_ExpectedRate","v":"Select Health Insurers"}]
["Debt Rate",{"$f":"B4","v":"1-Year"},{"$f":"UP_COC_Selection_InterestRate","v":"Low-Cost (Proxy: Aaa/AAA Yield)"}]
["Investment Yield",{"$f":"B5","v":"3-Year"}]
[]
{"$rows_left_out":58}
{"sheet":"Change Documentation","index":13,"n_rows":23,"n_cols":8,"rows_kept":23,"cut":false,"hidden":true,"merged":[]}
["Date of Change","Version before change","Version after change","Nature of the change ","Tabs and Macros affected","Author of change","Checker of change","Date of checking"]
["2024-02-02","2022-inderwriting-margin-model","2024 UM Model 02-2-24","added Change Documentation Tab","Change Documentation","Tom"]
["2024-02-03","2024 UM Model 02-2-24","2024 UM Model 02-3-24","deleted Premium allocation pie chart from Dashboard","Results Dashboard","Tom"]
["2024-02-03","2024 UM Model 02-2-24","2024 UM Model 02-3-24","Reduced print range of x axis for Distribution of Net Income and Underwriting Margin Chart ","Results Dashboard","Tom"]
["2024-02-03","2024 UM Model 02-2-24","2024 UM Model 02-3-24","Inserted column AE for displaying normal curve on Net Income and Underwriting Margin Chart","Results Dashboard, Net Income Matrix","Tom"]
["2024-02-05","2024 UM Model 02-3-24","2024 UM Model 02-5-24","Updated, all standard devs for curves, added two curves, updated size curve formula","User Parameters, Results Dashboard, Interpretation, Risk Macro","Tom"]
["2024-02-12","2024 UM Model 02-5-24","2024 UM Model 02-12-24","Added Yes/No toggle to Underwriting Margin Curve selection re: inclusion of Pandemic Period data","User Parameters","Mardo","Tom","2024-02-13"]
["2024-02-12","2024 UM Model 02-5-24","2024 UM Model 02-12-24","changed reference to curves with and w/o pandemic period data to \"Drop Downs\" tab","User Parameters, Results Dashboard","Mardo","Tom","2024-02-13"]
{"$rows_left_out":16}
{"sheet":"Macro Populated Cells","index":14,"n_rows":17,"n_cols":6,"rows_kept":17,"cut":false,"hidden":true,"merged":[[3,1,3,5],[15,1,15,5]]}
["Macro Populated Cells"]
[]
[]
[null,"Underwriting Margin Cells"]
[null,"Underwriting Margin Components"]
[null,"Cost of Capital for:"]
[null,"Target Capital",null,null,1.1247946060459247E-2]
[null,"Withholds Payment Delay",null,null,0]
{"$rows_left_out":9}