{"text_format":"1","workbook":"xlsx","n_sheets":13,"sheets":["Instructions","Interpretation","User Parameters","Results Dashboard","Graphs","COC Calculation","Net Income Matrix","Drop Downs","RBC Weights","Equity Premium","Tax Rates","Treasury and Corporate Yields","Macro Populated Cells"],"not_rendered":{"charts":6,"images":0,"macros":1,"external_links":0,"defined_names":150,"comments":3,"pivot_tables":0},"unopened":[],"bounds":{"document_bytes":16777216,"sheet_cells":100000,"rows_first":2000,"rows_last":500,"rows_between":2000,"halvings":0,"cell_chars":16384,"cell_head_chars":4096},"cells_cut":0,"cells_raw":0,"read":"whole","date_system":"1900"}

{"sheet":"Instructions","index":0,"n_rows":84,"n_cols":3,"rows_kept":84,"cut":false,"hidden":false,"merged":[[83,0,83,2],[0,0,0,2],[20,0,20,2],[18,0,18,2],[82,0,82,2],[81,0,81,2],[2,0,2,2],[16,0,16,2],[19,0,19,2]]}
["Instructions for the UW Margin Model"]
[]
["The purpose of the model is to help the actuary decide what the Underwriting Margin should be used in the premium rate development by enabling the actuary to test the sensitivity of assumptions."]
[]
["I.      Set assumptions for:"]
["*  General Parameters"]
["*  Cost of Capital Parameters"]
["*  Underwriting Margin Curve Activation"]
{"$rows_left_out":77}
{"sheet":"Interpretation","index":1,"n_rows":59,"n_cols":1,"rows_kept":59,"cut":false,"hidden":false,"merged":[]}
["Results Dashboard"]
[]
["     Selected Target Table"]
[]
["This table shows which of the three types of targets (Net Income, Risk Margin, or Probability of Ruin) was selected on the User Parameter tab. The model determines the risk margin necessary to achieve the target outcome. The table compares the target percentage to the result generated by the model and provides the variance."]
["- In most cases the variance will be zero. This will not typically be true when a Probability of Ruin target is selected. The result will be close to the target but the actuary may be able to minimize the variance by trying small changes to the risk margin."]
[]
["Note the Risk Margin target type is provided for convenience. A user would select this type to test a known margin amount as opposed to trying to achieve a Net Income target or a Probability of Ruin target."]
{"$rows_left_out":52}
{"sheet":"User Parameters","index":2,"n_rows":49,"n_cols":11,"rows_kept":49,"cut":false,"hidden":false,"merged":[[45,0,45,2],[32,4,32,9],[23,4,23,7],[22,4,22,9],[15,0,15,2],[0,1,0,2],[2,0,2,2],[0,6,0,7],[8,4,8,9],[2,4,2,9]]}
["SOA Underwriting Margin Model - USER PARAMETERS","Calculation Is Required",null,null,null,null,"Worksheet UnLocked"]
[]
["General Parameters",null,null,null,"MLR Provisions"]
[" 1. Calculation Target","Risk Margin",0.02,"i","38. Include Minimum MLR, Maximum MLR Provisions on Rates:",null,null,null,null,"No","i"]
[" 2. Average Monthly Enrollment",null,100000,"i","38.a. Minimum MLR",null,null,null,null,0]
[" 3. Months in Rating Period",null,12,"i","38.b. Maximum MLR",null,null,null,null,2]
[" 4. Member Months",null,{"$f":"C5*C6","v":1200000},"i"]
[" 5. UW Margin Curve - Standard Deviation","MCO Size Curve",{"$f":"VLOOKUP(UP_Curve_Name,'Results Dashboard'!A50:C58,3,FALSE)","v":3.29408739094647E-2},"i"]
{"$rows_left_out":42}
{"sheet":"Results Dashboard","index":3,"n_rows":58,"n_cols":20,"rows_kept":58,"cut":false,"hidden":false,"merged":[[20,0,20,1],[5,14,5,15],[12,0,12,2],[12,4,12,12],[3,0,3,2],[5,0,5,2],[6,0,6,1],[11,4,11,12],[19,0,19,3],[11,14,11,15],[12,14,12,15],[13,14,13,15],[14,14,14,15],[48,0,48,1],[47,3,47,4],[47,5,47,6],[47,7,47,8],[29,0,29,4],[46,0,46,8],[30,0,30,1],[30,6,30,7],[29,6,29,10],[47,0,47,2],[43,0,43,4],[0,4,0,6],[7,14,7,15],[8,14,8,15],[9,14,9,15],[10,14,10,15],[4,4,4,12],[4,14,4,18],[6,14,6,15],[5,4,5,5]]}
["SOA Underwriting Margin Model - RESULTS DASHBOARD",null,null,null,"Calculation Is Required"]
[]
[]
[{"$f":"\"Results Based On \" & 'User Parameters'!B8","v":"Results Based On MCO Size Curve"},null,null,"i"]
[null,null,null,null,"Probability of Ruin by RBC Level",null,null,null,null,null,null,null,null,"i","Gain and Loss Distribution",null,null,null,null,"i"]
[{"$f":"\"Selected Target: \"&UP_Target_Type","v":"Selected Target: Risk Margin"},null,null,"i","RBC Thresholds",null,"RBC %","RBC $M","RBC PMPM","RBC as a % of Premium","Probability of exceeding the  RBC Threshold","Value of Excess Losses as % of Premium","Given a loss, the average loss ($M) in excess of the  RBC Level",null,"Interval",null,"Starting Point","Gain Likelihood","Loss Likelihood"]
["Results",null,{"$f":"IF(UP_Target_Type=\"Probability of Ruin\",\"Probability\",\" % of Premium\")","v":" % of Premium"},null,"Authorized Control Level (ACL)",null,1,{"$f":"I7*'User Parameters'!$C$7","v":19107009.849447679},{"$f":"ACL","v":15.922508207873067},{"$f":"I7/$J$33","v":3.5029674312779695E-2},{"$f":"SUMIF('Net Income Matrix'!$AA$8:$AA$168,\"<= \" & -J7,'Net Income Matrix'!$AD$8:$AD$168)","v":2.4234544787719071E-2},{"$f":"-'Net Income Matrix'!AE5","v":3.1549958286551568E-4},{"$f":"IF(K7=0,0,L7*UP_Enrollment*12*'Results Dashboard'!$J$33/K7)","v":7101016.9752491359},null,"0 - 2%",null,0,{"$f":"SUMIFS('Net Income Matrix'!$AD$8:$AD$168,'Net Income Matrix'!$AA$8:$AA$168,\">=\" & Q7)-SUMIFS('Net Income Matrix'!$AD$8:$AD$168,'Net Income Matrix'!$AA$8:$AA$168,\">\" &Q8)","v":0.19950538529528505},{"$f":"SUMIFS('Net Income Matrix'!$AD$8:$AD$168,'Net Income Matrix'!$AA$8:$AA$168,\"<=\" & -Q7)-SUMIFS('Net Income Matrix'!$AD$8:$AD$168,'Net Income Matrix'!$AA$8:$AA$168,\"<\" & -Q8)","v":0.11669731287426677}]
["Target",null,{"$f":"'User Parameters'!C4","v":0.02},null,"200% of ACL",null,2,{"$f":"I8*'User Parameters'!$C$7","v":38214019.698895358},{"$f":"G8*I7","v":31.845016415746134},{"$f":"I8/$J$33","v":7.0059348625559389E-2},{"$f":"SUMIF('Net Income Matrix'!$AA$8:$AA$168,\"<= \" & -J8,'Net Income Matrix'!$AD$8:$AD$168)","v":1.1997222501739749E-3},{"$f":"-'Net Income Matrix'!AF5","v":1.1873830346632941E-5},{"$f":"IF(K8=0,0,L8*UP_Enrollment*12*'Results Dashboard'!$J$33/K8)","v":5398421.0458077826},null,"2 - 4%",null,0.02,{"$f":"SUMIFS('Net Income Matrix'!$AD$8:$AD$168,'Net Income Matrix'!$AA$8:$AA$168,\">=\" & Q8)-SUMIFS('Net Income Matrix'!$AD$8:$AD$168,'Net Income Matrix'!$AA$8:$AA$168,\">\" &Q9)","v":0.17959642632965617},{"$f":"SUMIFS('Net Income Matrix'!$AD$8:$AD$168,'Net Income Matrix'!$AA$8:$AA$168,\"<=\" & -Q8)-SUMIFS('Net Income Matrix'!$AD$8:$AD$168,'Net Income Matrix'!$AA$8:$AA$168,\"<\" & -Q9)","v":4.7730958201110563E-2}]
{"$rows_left_out":51}
{"sheet":"Graphs","index":4,"n_rows":62,"n_cols":9,"rows_kept":62,"cut":false,"hidden":false,"merged":[[19,1,19,4],[4,1,4,4],[52,1,52,4],[53,1,53,2],[54,1,54,2],[57,1,57,2],[56,1,56,2],[58,1,58,2],[59,1,59,2],[20,1,20,2],[55,1,55,2]]}
[]
[]
[]
[]
[null,"Probability of Ruin by RBC Level"]
[null,"RBC Thresholds","RBC %","RBC % of Prem","Probability > RBC"]
[null,{"$f":"'Results Dashboard'!E7","v":"Authorized Control Level (ACL)"},{"$f":"'Results Dashboard'!G7","v":1},{"$f":"'Results Dashboard'!J7","v":3.5029674312779695E-2},{"$f":"'Results Dashboard'!K7","v":2.4234544787719071E-2}]
[null,{"$f":"'Results Dashboard'!E8","v":"200% of ACL"},{"$f":"'Results Dashboard'!G8","v":2},{"$f":"'Results Dashboard'!J8","v":7.0059348625559389E-2},{"$f":"'Results Dashboard'!K8","v":1.1997222501739749E-3}]
{"$rows_left_out":55}
{"sheet":"COC Calculation","index":5,"n_rows":115,"n_cols":44,"rows_kept":115,"cut":false,"hidden":false,"merged":[[0,0,0,5],[45,0,45,5],[70,0,70,5],[80,0,80,5],[86,0,86,5],[1,0,1,5],[112,0,112,5],[8,0,8,5],[12,0,12,5],[20,0,20,5],[28,0,28,5],[48,0,48,5],[53,0,53,5],[66,0,66,5],[87,0,87,5],[99,0,99,5],[105,0,105,5],[11,0,11,5],[39,0,39,5],[42,0,42,5]]}
["Cost of Capital Calculation"]
["Shared Inputs:"]
["Member Months",null,{"$f":"UP_Enrollment*UP_MonthsInRatingPeriod","v":1200000},null,{"$f":"_xlfn.FORMULATEXT(C3)","v":"=UP_Enrollment*UP_MonthsInRatingPeriod"},"user parameter - Average Monthly Enrollment × Months in Rating Period"]
["Base Medical PMPM",null,{"$f":"UP_Medical_PMPM","v":400},null,"=UP_Medical_PMPM","user parameter - Medical Component PMPM"]
["Base Administrative PMPM",null,{"$f":"UP_Administrative_PMPM","v":40},null,"=UP_Administrative_PMPM","user parameter - Administrative Component PMPM (excl. UW margin or taxes)"]
["Base Premium PMPM (before taxes)",null,{"$f":"Results_Premium","v":454.54342697283204},null,"=Results_Premium","calculated - Base PMPM"]
["Gross Claims",null,{"$f":"C3*C4","v":480000000},null,{"$f":"_xlfn.FORMULATEXT(C7)","v":"=C3*C4"}]
["Gross Premium",null,{"$f":"C3*C6","v":545452112.3673985},null,{"$f":"_xlfn.FORMULATEXT(C8)","v":"=C3*C6"}]
{"$rows_left_out":108}
{"sheet":"Net Income Matrix","index":6,"n_rows":168,"n_cols":39,"rows_kept":168,"cut":false,"hidden":false,"merged":[[5,30,5,34],[5,1,5,3],[5,4,5,7],[5,27,5,29],[5,23,5,26],[5,19,5,22],[5,10,5,16]]}
["Net Income Matrix",null,null,null,null,null,null,null,null,null,"Risk Corridors:","I","II","III","IV","V","VI",null,null,null,null,null,null,null,null,null,null,null,{"$f":"'User Parameters'!B8","v":"MCO Size Curve"}]
[null,null,null,null,null,null,null,null,null,null,"Lower Threshold",{"$f":"IF(UP_RSBasis=\"No Risk Share\",0,'User Parameters'!F13)","v":0},{"$f":"L3","v":0},{"$f":"M3","v":0},{"$f":"N3","v":0},{"$f":"O3","v":0},{"$f":"P3","v":0},null,null,null,null,null,null,null,null,null,null,"Mean of Underwriting Margin",null,{"$f":"H88","v":3.1995682062082254E-2}]
[null,null,null,null,null,null,null,null,null,null,"Upper Threshold",{"$f":"IF(UP_RSBasis=\"No Risk Share\",0,'User Parameters'!H13)","v":0},{"$f":"IF(UP_RSBasis=\"No Risk Share\",0,'User Parameters'!H14)","v":0},{"$f":"IF(UP_RSBasis=\"No Risk Share\",0,'User Parameters'!H15)","v":0},{"$f":"IF(UP_RSBasis=\"No Risk Share\",0,'User Parameters'!H16)","v":0},{"$f":"IF(UP_RSBasis=\"No Risk Share\",0,'User Parameters'!H17)","v":0},{"$f":"IF(UP_RSBasis=\"No Risk Share\",0,'User Parameters'!H18)","v":0},null,null,null,null,null,null,null,null,null,null,"Standard Deviation",null,{"$f":"'User Parameters'!C8","v":3.29408739094647E-2}]
[null,null,null,null,null,null,null,null,null,null,"State Share",{"$f":"IF(UP_RSBasis=\"No Risk Share\",0,1-'User Parameters'!I13)","v":0},{"$f":"IF(UP_RSBasis=\"No Risk Share\",0,1-'User Parameters'!I14)","v":0},{"$f":"IF(UP_RSBasis=\"No Risk Share\",0,1-'User Parameters'!I15)","v":0},{"$f":"IF(UP_RSBasis=\"No Risk Share\",0,1-'User Parameters'!I16)","v":0},{"$f":"IF(UP_RSBasis=\"No Risk Share\",0,1-'User Parameters'!I17)","v":0},{"$f":"IF(UP_RSBasis=\"No Risk Share\",0,1-'User Parameters'!I18)","v":0},null,null,null,null,null,null,null,null,null,null,null,null,null,null,null,null,null,null,null,"excluding lag in CoC infusions"]
["Ave/Total",{"$f":"SUMPRODUCT(B$8:B$168,$AD$8:$AD$168)","v":454.54342697283192},400.00000000000011,0.88000392539810757,40.000000000000007,0,14.543426972831984,3.1995682062082142E-2,0.88000392539810757,0,0,{"$f":"SUMPRODUCT(L$8:L$168,$AD$8:$AD$168)","v":0},0,0,0,0,0,{"$f":"SUMPRODUCT(R$8:R$168,$AD$8:$AD$168)","v":0},0,0.88000392539810757,0.88000392539810757,0,0,3.1995682062082142E-2,0,0,{"$f":"SUMPRODUCT(AA$8:AA$168,$AD$8:$AD$168)","v":3.1995682062082142E-2},null,{"$f":"SUM(AC$8:AC$168)","v":0.99999999999999944},{"$f":"SUM(AD$8:AD$168)","v":1},{"$f":"SUMPRODUCT(AE$8:AE$168,$AD$8:$AD$168)","v":-3.1549958286551568E-4},{"$f":"SUMPRODUCT(AF$8:AF$168,$AD$8:$AD$168)","v":-1.1873830346632941E-5},{"$f":"SUMPRODUCT(AG$8:AG$168,$AD$8:$AD$168)","v":-1.1873830346632941E-5},{"$f":"SUMPRODUCT(AH$8:AH$168,$AD$8:$AD$168)","v":-3.6852144512593884E-11},{"$f":"SUMPRODUCT(AI$8:AI$168,$AD$8:$AD$168)","v":-3.6852144512593884E-11},null,{"$f":"SUMPRODUCT(AK$8:AK$168,$AD$8:$AD$168)","v":0},0,{"$f":"SUMPRODUCT(AM$8:AM$168,$AD$8:$AD$168)","v":3.1995682062082142E-2}]
["Bin","Claims Calculation",null,null,"Underwriting Margin Calculation",null,null,null,"MLR","Risk Share Target","Risk Corridor Calculations",null,null,null,null,null,null,null,null,"MLR Limit Calculation",null,null,null,"Net Income Calculation",null,null,null,"Normal Curve",null,null,"Probability of Ruin Results"]
["Loss Ratio","Prem PMPM","Claims PMPM","Initial MLR","Admin","Premium Tax","Underwriting Margin","Underwriting Margin Ratio","Alternative:\nFor purposes or Risk Share use MLR (as used for MLR Limit) not Loss Ratio",{"$f":"IF(UP_RSBasis=\"MLR\",\"Risk Share Target %\",IF(UP_RSBasis=\"Medical Baseline\",\"Claims PMPM\",\"N/A\"))","v":"N/A"},{"$f":"IF(UP_RSBasis=\"MLR\",\"MLR Gain/(Loss)\",IF(UP_RSBasis=\"Medical Baseline\",\"Medical Gain/(Loss)\",\"\"))","v":""},"Corridor I","Corridor II","Corridor III","Corridor IV","Corridor V","Corridor VI",{"$f":"IF(UP_RSBasis=\"MLR\",\"MLR Adjustment\",\"\")","v":""},"Claims Adjustment","Adjusted MLR","Capped MLR","Net Transfer Payment ","Net Transfer Payment as a % of Prem","Gain/Loss as a % of Prem","Cost of Capital Infusion on Gains/Losses Before Transfer Payments (as a % of Prem)","Withhold Unachieved as a % of Prem","Net Income as a % of Prem","Density Function","Probability","Adjusted Probability","Authorized Control Level (ACL)","200% of ACL","Minimum Threshold",{"$f":"\"Target  (Discount = \"&UP_COC_RBCThresholdDiscount*100&\"%)\"","v":"Target  (Discount = 0%)"},"Maximum Threshold"]
[{"$f":"A9-0.005","v":0.48000392539810666},{"$f":"$B$88","v":454.54342697283204},{"$f":"B8*A8","v":218.18262921086702},{"$f":"(C8)/(B8)","v":0.48000392539810666},{"$f":"'User Parameters'!$C$10","v":40},{"$f":"B8*'User Parameters'!$C$14","v":0},{"$f":"B8-E8-C8-F8","v":196.36079776196502},{"$f":"G8/B8","v":0.43199568206208261},{"$f":"($C8+UP_QIPMPM)/($B8-$F8)","v":0.48000392539810666},{"$f":"IF(UP_RSBasis=\"MLR\",UP_RSTarget_MLR,IF(UP_RSBasis=\"Medical Baseline\",UP_RSTarget_Medlcal,0))","v":0},{"$f":"IF(UP_RSBasis=\"MLR\",J8-I8,IF(UP_RSBasis=\"Medical Baseline\",J8-$C8,0))","v":0},{"$f":"IF($K8>0,MIN(J8*L$3-J8*L$2,$K8-M8-N8),0)","v":0},{"$f":"IF($K8>0,MIN(J8*M$3-J8*M$2,$K8-N8),0)","v":0},{"$f":"IF($K8>0,MIN(J8*N$3-J8*N$2,$K8),0)","v":0},{"$f":"IF($K8<0,MAX(J8*O$2-J8*O$3,$K8),0)","v":0},{"$f":"IF($K8<0,MAX(J8*P$2-J8*P$3,$K8-O8),0)","v":0},{"$f":"IF($K8<0,MAX(J8*Q$2-J8*Q$3,$K8-P8-O8),0)","v":0},{"$f":"IF(UP_RSBasis=\"MLR\",SUMPRODUCT(L$4:Q$4,L8:Q8),\"\")","v":""},{"$f":"IF(UP_RSBasis=\"MLR\",R8*(B8-F8),SUMPRODUCT($L$4:$Q$4,$L8:$Q8))","v":0},{"$f":"(S8+C8+'User Parameters'!$C$11)/(B8-F8)","v":0.48000392539810666},{"$f":"IF(T8<'User Parameters'!$J$5,'User Parameters'!$J$5,IF(T8>'User Parameters'!$J$6,'User Parameters'!$J$6,T8))","v":0.48000392539810666},{"$f":"(U8-T8)*(B8-F8)","v":0},{"$f":"V8/B8","v":0},{"$f":"(B8-C8-F8-E8-S8-V8)/'Results Dashboard'!$D$42","v":0.43199568206208261},{"$f":"IF((X8+W8)>0,(X8+W8)*0.5*((1+'User Parameters'!C$48)^((12+UP_COC_WithholdLag)/12)-1),(X8+W8)*0.5*((1+'User Parameters'!$C$49)^((12+UP_COC_WithholdLag)/12)-1))","v":0},{"$f":"-'User Parameters'!$C$12*('User Parameters'!$C$13-1)","v":0},{"$f":"Y8+X8-Z8","v":0.43199568206208261},{"$f":"_xlfn.NORM.DIST(H8,$AD$2,$AD$3,TRUE)","v":1},{"$f":"AB8-AB9","v":0},{"$f":"AC8+(1-AC5)/2","v":2.7755575615628914E-16},{"$f":"IF($AA8<-'Results Dashboard'!$J$7,$AA8+'Results Dashboard'!$J$7,0)","v":0},{"$f":"IF($AA8<-'Results Dashboard'!$J$8,$AA8+'Results Dashboard'!$J$8,0)","v":0},{"$f":"IF($AA8<-'Results Dashboard'!$J$9,$AA8+'Results Dashboard'!$J$9,0)","v":0},{"$f":"IF($AA8<-'Results Dashboard'!$J$11,$AA8+'Results Dashboard'!$J$11,0)","v":0},{"$f":"IF($AA8<-'Results Dashboard'!$J$10,$AA8+'Results Dashboard'!$J$10,0)","v":0},null,{"$f":"IF((X8+W8)>0,(X8+W8)*0.5*'User Parameters'!C$48,(X8+W8)*0.5*'User Parameters'!$C$49)","v":0},{"$f":"-'User Parameters'!$C$12*('User Parameters'!$C$13-1)","v":0},{"$f":"-AK8+X8-AL8","v":0.43199568206208261}]
{"$rows_left_out":161}
{"sheet":"Drop Downs","index":7,"n_rows":110,"n_cols":5,"rows_kept":110,"cut":false,"hidden":true,"merged":[]}
[]
["Yes/No Toggle"]
["Yes"]
["No"]
[]
[]
["Interest Rate for Cost of Debt (%)"]
["Moderate (Proxy: Baa Yield)",{"$f":"'Treasury and Corporate Yields'!F9","v":4.1129508196721315E-2}]
{"$rows_left_out":103}
{"sheet":"RBC Weights","index":8,"n_rows":62,"n_cols":11,"rows_kept":62,"cut":false,"hidden":true,"merged":[[20,1,20,6],[20,8,20,10],[15,0,15,2]]}
["Calculation of Relative Weights of RBC Risk Factors"]
[]
["Selection Criteria:",{"$f":"UP_COC_Selection_H4","v":"Medicaid-Dominant"}]
[]
["Relative Contribution to ACL:","SELECTED","ALL FILINGS","MEDICAID-DOMINANT FILINGS"]
["H0",{"$f":"IF($B$3=\"Medicaid-Dominant\",D6,C6)","v":2.5336962234345423E-2},{"$f":"B32","v":0.1127281279261159},{"$f":"I32","v":2.5336962234345423E-2}]
["H1^2",{"$f":"IF($B$3=\"Medicaid-Dominant\",D7,C7)","v":8.4931946684462842E-2},{"$f":"B33","v":0.22199950203609375},{"$f":"I33","v":8.4931946684462842E-2}]
["H2^2",{"$f":"IF($B$3=\"Medicaid-Dominant\",D8,C8)","v":1},{"$f":"B34","v":1},{"$f":"I34","v":1}]
{"$rows_left_out":55}
{"sheet":"Equity Premium","index":9,"n_rows":48,"n_cols":6,"rows_kept":48,"cut":false,"hidden":true,"merged":[]}
["Calculation of Equity Risk Premium"]
[]
["Sources: ","Annual Return and Trailing 12-Mon Return derived from Month-End Close, from Google Finance function in Google Sheets"]
[null,"Dividends reflects historical dividend payments, from Dividend Investor (Internet: https://www.dividendinvestor.com/dividend-history/)"]
[null,"For \"Equity Risk Premium\" proxy, data reflects  ERP T12m field (replaced with ERP T12m with COVID Adjustment where applicable), from Damodaran Online (Internet: http://people.stern.nyu.edu/adamodar/New_Home_Page/home.htm)"]
[]
["Period:","Jan-2011 through Dec-2021"]
[]
{"$rows_left_out":41}
{"sheet":"Tax Rates","index":10,"n_rows":69,"n_cols":5,"rows_kept":69,"cut":false,"hidden":true,"merged":[]}
["State Corporate Tax Rates"]
[]
["Source:","Tax Foundation. \"State Corporate Income Tax Rates and Brackets for 2021\" Internet: https://taxfoundation.org/state-corporate-tax-rates-2021/"]
[]
["Period",2021]
[]
["STATE","Rate (%)","Federal Tax Deduction","Top Bracket","Note"]
["Alabama",6.5000000000000002E-2,1,0]
{"$rows_left_out":62}
{"sheet":"Treasury and Corporate Yields","index":11,"n_rows":144,"n_cols":13,"rows_kept":144,"cut":false,"hidden":true,"merged":[]}
["Calculation of Risk-Free Rate of Return and Proxy for Cost of Debt"]
[]
["Source: Federal Reserve Bank of St. Louis, Economic Research Division. ALFRED (Archival Federal Reserve Economic Data). Internet: https://alfred.stlouisfed.org"]
[]
["Selected Time Period:",{"$f":"'User Parameters'!C27","v":"5-Year"}]
["Most Recent Year",2021]
[]
[null,"3-Month Treasury","10-Year Treasury","20-Year Treasury","Corporate Aaa","Corporate Baa"]
{"$rows_left_out":137}
{"sheet":"Macro Populated Cells","index":12,"n_rows":17,"n_cols":6,"rows_kept":17,"cut":false,"hidden":true,"merged":[[3,1,3,5],[15,1,15,5]]}
["Macro Populated Cells"]
[]
[]
[null,"Underwriting Margin Cells"]
[null,"Underwriting Margin Components"]
[null,"Cost of Capital for:"]
[null,"Target Capital",null,null,1.1996292413644723E-2]
[null,"Withholds Payment Delay",null,null,0]
{"$rows_left_out":9}