{"text_format":"1","workbook":"xlsx","n_sheets":13,"sheets":["Instructions","Interpretation","User Parameters","Results Dashboard","Graphs","COC Calculation","Net Income Matrix","Drop Downs","RBC Weights","Equity Premium","Tax Rates","Treasury and Corporate Yields","Macro Populated Cells"],"not_rendered":{"charts":6,"images":0,"macros":1,"external_links":0,"defined_names":150,"comments":3,"pivot_tables":0},"unopened":[],"bounds":{"document_bytes":16777216,"sheet_cells":100000,"rows_first":2000,"rows_last":500,"rows_between":2000,"halvings":0,"cell_chars":16384,"cell_head_chars":4096},"cells_cut":0,"cells_raw":0,"read":"whole","date_system":"1900"}

{"sheet":"Instructions","index":0,"n_rows":84,"n_cols":3,"rows_kept":84,"cut":false,"hidden":false,"merged":[[83,0,83,2],[0,0,0,2],[20,0,20,2],[18,0,18,2],[82,0,82,2],[81,0,81,2],[2,0,2,2],[16,0,16,2],[19,0,19,2]]}
["Instructions for the UW Margin Model"]
[]
["The purpose of the model is to help the actuary decide what the Underwriting Margin should be used in the premium rate development by enabling the actuary to test the sensitivity of assumptions."]
[]
["I.      Set assumptions for:"]
["*  General Parameters"]
["*  Cost of Capital Parameters"]
["*  Underwriting Margin Curve Activation"]
["*  Risk-Sharing Parameters"]
["*  Managed Care Discounts for RBC Calculation"]
["*   Income Matrix - Interest Income / Interest Expense"]
["*  User-Defined Values"]
[]
["II.      Press Calculate Button"]
[]
["III.      Lock / Unlock Button"]
["Pressing the Lock/Unlock button will initiate a macro that will activate the protection or cancel the protection of the locked cells in the worksheets. when \"Locked\", only unlocked cells will be available for modifications, i.e., parameter selections and user inputs. This feature is being provided as a convenience utility to prevent the user from unintentionally altering formulas, cell references or pre-existing cell contents. At this time there is no password to lock or unlock, but the SOA may at its sole discretion include a password in the future"]
[]
["Note: All input fields in the User Parameters tab are initially shaded in light orange/salmon color, aka \"Orange, Accent 6, Lighter 80%\" in Excel-speak. Selecting \"User-Defined\" in a field where that option is available will change the shading to a light green for that parameter and the corresponding parameter under \"User-Defined Parameter Inputs\" section of the User Parameters tab"]
["For ease of use and reference, the following instructions are laid out and displayed in the same form as the structure in the User Parameters tab "]
["User Parameters"]
[]
["General Parameters",null,"MLR Provisions"]
["  1.       Calculation Target: Select the type of target, i.e., Net Income, Risk Margin or Probability of Ruin, and the target level for the UW Margin Model to solve. For the net income and risk margin options, enter a value as a percentage of premium. For the ruin option, enter the probability of ruin",null,"38.   Include Minimum MLR, Maximum MLR Provisions on Rates: Select \"Yes\" to turn on this option and provide those values in #38.a. and #38.b."]
["  2.       Average Monthly Enrollment: Enter the estimated average monthly enrollment in the benefit plan for the rate period under consideration",null,"38.a.   Minimum MLR: Enter minimum applicable MLR parameter, e.g., 85%. If  both the Risk Sharing Parameters and the MLR are entered, the Risk Sharing parameters will be applied first and the Minimum MLR will be applied next"]
["  3.       Months in Rating Period: Enter the number of months in the rate period for the rate period under consideration",null,"38.b.   Maximum MLR: Enter maximum applicable MLR parameter"]
["  4.       Member Months: This field is automatically calculated with the preceding 2 parameters and represents the member months for the rate period"]
["  5.       UW Margin Curve - Standard Deviation: Select the desired UW Margin Curve to be used from the available options",null,"Risk Share (RS) Parameters"]
["a.       If selecting  \"User-Defined Curve\", input the Standard Deviation of your curve in the related field under the User-Defined Parameter Inputs section",null,"39.    Baseline for Risk Share: Select \"No Risk Share\", \"MLR\" or \"Medical Baseline\" to indicate the type of risk-sharing arrangement between the state and the MCO "]
["b.       Note: The model also provide the user with the option to calculate the risk margin, probability of ruin and the likelihood of loss for all the curves, the results of which are summarized in a table in the Results Dashboard. However, the detailed analysis provided in the Results Dashboard applies only to the primary curve selected in #5",null,"40.    MLR Target: Visible only when \"MLR\" is selected for Baseline for Risk Share in #39. Enter the Target MLR specified in the Risk Share provisions of the contract"]
["  6.       Claims Expense PMPM: Enter the estimated Claims Expense PMPM for the rate period under consideration",null,"41.    Intervals: Enter the intervals of the corridors for the risk sharing arrangement"]
["a.       The model will provide a warning to verify your input when you enter a value that is either below $100 PMPM or above $1,000 PMPM. You may override the warning after verification of your input",null,"42.    MCO Responsibility: Enter the MCO responsibility % for gains and losses at each of the intervals "]
["  7.      Administrative Expenses PMPM: Enter estimated Administrative Expense PMPM for the rate period under consideration. Note that this amount should include the QI Allowance noted separately below"]
[" 8.       QI Allowance PMPM: Enter the amount of Quality Improvement (QI) to be included in rates as PMPM. This is used to calculate the MLR. The Administrative Expense PMPM provided above should also include this QI PMPM"]
["  9.      Withhold %: Enter the withhold amount, stated as a percent of premium"]
["a.       The model will provide a warning to verify your input when you enter a value that is greater than 25%. You may override this warning"]
["10.      Withhold Earned %: Enter the percent (% ) of the withhold that is reasonably expected to be earned by the MCO"]
["a.       Suggested default value is 100%"]
["11.   State Premium Tax %: Enter the state premium tax, if any, as a percent of premium for the rate period under consideration"]
[]
["Cost of Capital (COC) Parameters"]
["Parameters for Risk Based Capital (RBC) Calculation",null,"17. Managed Care Discounts for RBC Calculation"]
["Per the NAIC, \"The RBC requirement is a statutory minimum level of capital... the company must hold [capital] in proportion to its risk. RBC is intended to be a regulatory standard and not necessarily the full amount of capital that an insurer would need to hold to meet its objectives.\" The Cost of Capital component of the UW Margin is a way to recognize the opportunity cost of the capital requirements maintained by the insurer.",null,"This section develops the Managed Care discount factor used in the NAIC's RBC calculation formula when \"NAIC Filings + User Parameters\" is selected in #15. Enter the estimated percent (%) of claims that fall under the referenced payment arrangement."]
["12.   Minimum RBC Target Threshold: Enter the Minimum Risk Based Capital (RBC) target for the Cost of Capital calculation",null,"17.a.   Category 0 -  Arrangements not Included in Other Categories: Worksheet-calculated field, based on the inputs for 17.b. through 17.e. "]
["a.       Note:",null,"17.b.   Category 1 -  Payments made according to contractual arrangements: Enter the percent of claims paid according to contractual arrangements"]
["i.       Authorized Control Level (ACL) = 100% RBC",null,"17.c.   Category 2a/b -  Payments subject to withhold/bonus: Enter the percent of claims paid that are subject to withholds or bonuses"]
["ii.       Many states require a minimum of 200% RBC, check with the applicable state regulation",null,"17.d.   Category 3a/b -  Capitated payments to providers/intermediaries: Enter the percent of claims covered by capitation payments"]
["13.   Maximum RBC Target Threshold: Enter the Maximum RBC target for the Cost of Capital calculation. The Maximum RBC Target must be higher than the Minimum RBC Target for the model to develop the probability of ruin. If there is no specific maximum RBC target required, consider using the average of 450% noted in this report, with a discount of 0%. If a specific target RBC is desired, enter 100% for the discount in #14 to set the minimum and the maximum RBC targets to the same value",null,"17.e.   Category 4 -  Expenses paid as salary to providers: Enter the percent of claims covered through provider salaries"]
["14.   Discount to apply to RBC between Thresholds: Enter the desired discount to apply to the Cost of Capital calculation for the RBC level between the minimum and maximum target RBCs. To target the model's calculation towards a specific RBC level, set the discount to 100%, which will effectively set the target at the Minimum RBC Target Threshold",null,"17.f.    Composite Managed Care Discount Factor: This is calculated automatically as a weighted average based on the values in 17.a. through 17.e. "]
["15.   Calculation of Authorized Control Level (ACL) as % of Premium: Select the method with which the ACL is to be determined. \"NAIC Filings + User Parameters\" will incorporate State/MCO-specific information provided by the user, including Claims, admin and the information in 17.a. through 17.e., along with NAIC data on risk classes, i.e., H0 through H41 to determine the ACL RBC as a percent of Premium. \"NAIC Filings (Medicaid-Dominant)\"  uses the average aggregate data for health insurers with 50% or more of premiums composed of Medicaid Title XIX for CY 2019 and 2020. \"NAIC Filings (All)\" uses the average aggregate data for all health insurers for CY 2016 through CY 2020 1. For the \"User-Defined\" options, enter the ACL as a % of premium to be used in the COC calculations in the related field under User-Defined Parameter Inputs section"]
["16.   Selection of NAIC Health Insurer Filings for RBC Risk Factors Weights: Select whether to use Medicaid-dominant (as defined above) health insurers or all health insurers as the source for RBC risk factor weights. Medicaid-dominant health insurers tend to exhibit lower H0 Risk - Affiliate (with RBC) Asset Risk than all health insurers, and higher H2-Underwriting Risk than all health insurers. The user/actuary may consider the participating MCO(s) lines of business when selecting this option"]
["17.   Managed Care Discount Factor (applied to Underwriting Risk): Worksheet-calculated field for the Managed Care Discount factor for H2 - Underwriting Risk, as calculated in \"Managed Care Discount for RBC Calculation\" section adjusts for the level of risk borne by the MCO(s), in consideration of  MCOs' financial and contractual arrangements with providers and intermediaries. This option is only available when the user selects \"NAIC Filings + User Parameters\" in #15 above"]
[]
["Parameters for Weighted Average Cost of Capital (WACC) Calculation"]
["Per Investopedia, \"The weighted average cost of capital (WACC) represents a firm's average cost of capital from all sources, including common stock, preferred stock, bonds, and other forms of debt. The weighted average cost of capital is a common way to determine required rate of return because it expresses, in a single number, the return that both bondholders and shareholders demand in order to provide the company with capital.\""]
["18.   State Corporate Tax Rate: Select the state corporate tax rate from the drop-down list, or select \"User-Defined\" to enter the state corporate tax rate in the User-Defined Parameter Inputs section. Note that the pre-populated rates available in the drop-down list are an estimate and may not be reflective of your case-use needs"]
["19.   Federal Corporate Tax Rate: Enter the corporate tax rate"]
["20.   Historical Period for Benchmark Rates of Returns & Betas: Select 10-year, 5-year or 3-year periods for the Beta2 of the benchmark references to be used in the cost of equity calculation. Suggested default is \"10-Year\" time period"]
["21.   Risk-Free Rate of Return: Select the risk-free rate from the drop-down list or select \"User-Defined\" to enter the risk-free rate in the User-Defined Parameter Inputs section. Suggested default is \"10-Yr Treasury\""]
["22.   Equity Risk Premium: Select the method by which the Equity Risk Premium will be determined. The \"CAPM Calculated\" [Capital Asset Pricing Model] option will use the S&P 500 returns for the time period selected in #20, less the Risk-Free rate selected in #21, the result of which will be multiplied by the Beta selected in #23. The \"Implied Eq.[uity] Risk Prem.[ium] (Damodaran)\" option will use the equity risk premium developed by Aswath Damodaran, professor of finance at the Stern School of Business at New York University3 . A User-Defined option is also available, the value for which can be provided in the User-Defined Parameter Inputs section"]
["23.   Beta of Benchmark Expected Rate of Return: Select the benchmark from which the Beta2 value will be used to calculate the Equity Risk Premium and the Cost of Equity for \"CAPM Calculated\" option in #22. Choices include S&P 500, select health insurers (top 6 in market capitalization), utilities, and an option for a user-defined Beta, the value for which can be entered in the User-Defined Parameter Inputs section"]
["24.   Calculate Cost of Equity on an After-Tax or Pre-Tax Basis: Select After-Tax to calculate the Cost of Equity using the face value of the selected benchmark market risk premium using CAPM, the Implied Risk Premium (Damodaran) or the User-Defined Equity Risk Premium. Select Pre-Tax to further gross-up the calculated Cost of Equity for the Federal corporate tax rate provided in #19. Suggested default is \"After-Tax\""]
["25.   Cost of Equity: This is a calculated field based on the inputs for #19 through #23",null,"User-Defined Parameter Inputs"]
["26.   Recognize Debt in Calculation of COC: Select Yes/No on whether to recognize debt in the COC calculation. Select \"No\" If cost of debt is recognized in administrative expenses, i.e., interest payments. Suggested default value is \"Yes\"",null,"In this section, provide the values for the \"User-Defined\" selections in the General Parameters, Cost of Capital and Income Matrix sections. Note that cells in this section that are highlighted in light green indicated that \"User-Defined\" was selected in the corresponding parameter."]
["27.   Interest Rate for Debt: Select the proxy for interest rate on debt from the drop-down list, or select \"User-Defined\" to provide a specific value to use for interest rate for debt in the User-Defined Parameter Inputs section. Suggested default is \"Low-Cost (Proxy: Aaa Yield)\"",null,"5.     General Parameter - User-Defined Curve (Standard Deviation %): Enter the standard deviation of the underwriting margin curve to be used in the development of the Underwriting Margin, as an alternative to the options offered in the drop-down list"]
["28.   Percent (%) Debt for MCO Debt/Equity Ratio: Input the percent of Surplus (Reserve) financed by Debt for inclusion in the WACC calculation",null,"15.   COC Parameter - Authorized Control Level (ACL) as a % of Premium: Enter the specific ACL ratio as a percent of Premium to be used as an alternative to the options offered in the drop-down list"]
["29.   Weighted Average Cost of Capital % (WACC%): This is a calculated field based on the values in #25 through #28",null,"18.   COC Parameter - State Corporate Tax Rate: Enter a State corporate tax rate to be used in the COC calculation, as an alternative to the options offered in the drop-down list"]
["30.   Discount to Cost of Capital (Investment Earnings on Reserves): Select the form of discount, if any, to be applied to the Cost of Capital, to recognize potential investment earnings an MCO receives on its existing capital reserves. The options include a user-defined value, which can be provided in the User-Defined Parameter Inputs section ",null,"20.   COC Parameter - Risk-Free Rate of Return: Enter the risk-free rate to be used in the COC calculation, as an alternative to the options offered in the drop-down list"]
["Parameters for Cash Flow",null,"22.   COC Parameter - Beta of Benchmark Rate of Return: Enter the Beta factor to be used in the Cost of Equity calculation, as an alternative to the options offered in the drop-down list"]
["This section recognizes the time value of money as it relates to lag in recoupment of withholds by the MCO, delay in premium payments to the MCO, and the claims payment lag from the MCO to the providers",null,"23.   COC Parameter - Equity Risk Premium: Enter the equity risk premium % to be used in the Cost of Equity calculation, as an alternative to the options offered in the drop-down list"]
["31.   Withhold Lag - number of Months after Rating Period before Withhold Paid: Input average number of month(s), as fraction or whole number, after the end of the rating period, before withhold is paid to MCO. Allowed values are 0 to 24",null,"27.   COC Parameter - Interest Rate for Debt (%): Enter the interest rate for debt to be used in the calculation of the WACC, as an alternative to the options offered in the drop-down list"]
["32.   Payment Lag - Number of Months before Monthly Premium Paid: Input average number of month(s), as fraction or whole number, before premium is paid to MCO",null,"30.   COC Parameter - Discount to Cost of Capital: Enter the discount rate  to be applied to the COC to account for earning on surplus/reserves, as an alternative to the options offered in the drop-down list"]
["33.   Factor to Apply to MCO Revenue Lag: Select the factor with which the MCO is compensated for the revenue lag related to withholds and premiums, which are In effect the financing cost provided to the State by the MCO for the delay in payments. Suggested default is \"Cost of Debt\", with a user-defined option available for the user to provide a value in the User Defined Parameter Inputs section",null,"33.   COC Parameter - Factor to Apply to MCO Revenue Lag: Enter a compensation rate to be used in the COC calculation, as an alternative to the options offered in the drop-down list"]
["34.   Claims Lag - Average Claims Payment Lag (in Months): Input average number of month(s), as fraction or whole number, before claims are paid by MCO. Allowed values are 0 to 24. This will be an offset to the MCO revenue Lag applied above.\nEnter 0 to exclude this provision from the Cost of Capital calculation",null,"36.   Income Matrix - Interest Income On Gains: Enter the interest rate to be used to calculate interest income on gains in the income matrix, as an alternative to the options offered in the drop-down list"]
["35.   Percent (%) of Claims Subject to Claims Payment Lag: Enter percent (%) of the medical component (claims) that is subject to the claims payment lag entered in #34. Suggested default is the % of Claims that are neither capitated (Categories 3 a/b in #17.d.), nor paid as salaries (Category 4 in #17.e.) as indicated in the \"17. Managed Care Discount for RBC Calculation\" section",null,"37.   Income Matrix - Interest Expense On Losses: Enter the interest rate to be used to calculate interest expense on losses in the income matrix, as an alternative to the options offered in the drop-down list"]
[]
["Income Matrix - Interest Income / Interest Expense"]
["36.   Interest Income on Gains: Select the rate of return for the interest income calculation on the probability of gain scenarios in the bin calculation inside the Income Matrix. A user-defined option is available for the user to provide a specific value in the User Defined Parameter Inputs section"]
["37.   Interest Expense on Losses: Select the rate of return on for the interest expense calculation on the probability of loss scenarios in the bin calculation inside the Income Matrix. A user-defined option is available for the user to provide a specific value in the User Defined Parameter Inputs section"]
[]
[]
["1 Source: NAIC. \"Aggregated Health Risk-Based Capital Data\" (2016-2020) Internet: https://content.naic.org/sites/default/files/inline-files/2020%20Health%20RBC%20Statistics_as%20of%202020-06-30.pdf"]
["2 The beta (β) of an investment security (i.e., a stock) is a measurement of its volatility of returns relative to the entire market. It is used as a measure of risk and is an integral part of the Capital Asset Pricing Model (CAPM). A company with a higher beta has greater risk and also greater expected returns. From Corporate Finance Institute online (Internet: https://corporatefinanceinstitute.com/resources/knowledge/valuation/what-is-beta-guide/)"]
["3 Refer to the report \"Medicaid Managed Care Underwriting Margin Model\" for additional discussion on the subject. From Damodaran online (Internet: http://people.stern.nyu.edu/adamodar/New_Home_Page/home.htm)"]

{"sheet":"Interpretation","index":1,"n_rows":59,"n_cols":1,"rows_kept":59,"cut":false,"hidden":false,"merged":[]}
["Results Dashboard"]
[]
["     Selected Target Table"]
[]
["This table shows which of the three types of targets (Net Income, Risk Margin, or Probability of Ruin) was selected on the User Parameter tab. The model determines the risk margin necessary to achieve the target outcome. The table compares the target percentage to the result generated by the model and provides the variance."]
["- In most cases the variance will be zero. This will not typically be true when a Probability of Ruin target is selected. The result will be close to the target but the actuary may be able to minimize the variance by trying small changes to the risk margin."]
[]
["Note the Risk Margin target type is provided for convenience. A user would select this type to test a known margin amount as opposed to trying to achieve a Net Income target or a Probability of Ruin target."]
[]
["      Probability of Ruin by RBC Level Table"]
[]
["This table show the probability of ruin, the likelihood of spending all of the RBC Reserve on losses, for various RBC levels. The RBC amount is shown as a dollar amount, PMPM and a percent of premium. The value of excess losses is the expected value of net income losses in excess of the RBC level. This value provides the actuary with a best estimate of the amount to maintain  solvency. The last column shows, assuming a loss in excess of the RBC level, the average loss amount ($M) weighted by the relative probability of occurrence."]
[]
["Additional probability of ruin information is also presented in the form of:"]
["- The probability that the RBC equity will fall below the User-Defined Minimum RBC level, as measured from the Implied Target RBC level."]
["- The probability that the RBC equity will fall below the 200% of ACL RBC level, as measured from the Implied Target RBC level."]
[]
["      Gain and Loss Distribution Table and Graph"]
[]
["This table shows the likelihood of a gain or a loss for various percentage intervals.  It also totals how often a gain or a loss will occur for all intervals, and what the average gain is given that a gain occurs, and what the average loss is given that a loss occurs. The graph below the table depicts the same information."]
[]
["      Underwriting Margin Table"]
[]
["This table provides the user with the basic components of the Underwriting Margin, the Risk Margin and the Cost of Capital as determined by the model."]
[]
["      Underwriting Margin Accounting Table"]
[]
["This table is an accounting of the components of the Underwriting Margin or how the Underwriting Margin is deployed to meet the flow of gains and costs including the Withhold Not Achieved, Net Transfer Payments for Minimum and Maximum MLR provisions, Risk Sharing Adjustments, and the Net Cost of Capital Infusions. Note that these entries may be positive or negative values depending upon the choice of user parameters. The Net Income is the remainder, or balancing item, after the gains and costs are netted against the Underwriting Margin."]
[]
["     Distribution of Net Income and Underwriting Margin Graph"]
[]
["The graph shows the Underwriting Margin, Net Income and Probability of Occurrence for each loss ratio interval. The probabilities are set using a normal curve which is defined by the mean and the standard deviation.  The mean is the loss ratio based on the user assumptions.  The standard deviation for the normal curve is set by the user’s selection of available curves on the parameter page. The Underwriting Margin is the Cost of Capital and the Risk Margin for each loss ratio interval.  The Net income is also shown for each loss ratio interval."]
[]
["      Premium Development and Cost of Capital Summary Table"]
[]
["This table shows the components used to build the premium. The premium includes the user-provided assumptions for claims, administrative expenses and premium taxes and the model-generated numbers for cost of capital and risk margin. The results are show as $M (millions), PMPM and percent of premium."]
["This table also shows the Minimum Loss Ratio as per CMS definition."]
[]
["      Income Statement Table"]
[]
["This table shows the revenues, expenses and net income before taxes associated with the user’s capitation product. The Withhold Not Achieved and Net Transfer Payments are considered adjustment to revenue while the Risk Sharing Adjustments and Cost of Capital Infusions are considered adjustment to expenses."]
[]
["Analysis of Underwriting Margin Curves"]
[]
["This table shows the standard deviation of the curve option, the risk margin, the probability of ruin based on the target RBC, and likelihood of loss for all of the normal curve options. The target type and target amount are documented in the top line of this table. The curve that is highlighted in pink is the curve of the user-selected goal seek target in #1 on the User Parameters tab. Other curve results are shown only when the user selects \"Yes\" to the prompt asking whether the calculation should proceed on the other available curves. The High/Low column identifies which of the curves produces the highest risk margin and which of the curves produces the lowest risk margin."]
["The standard deviations for the underwriting margin curves were determined as follows:"]
["Composite 2013 to 2019 Curve - based on Medicaid MCO NAIC data for CY2013 through CY2019 adjusted to maximize the fit to the data as measured by the R-squared statistic."]
["Composite 2013 to 2015 Curve - based on Medicaid MCO NAIC data for CY2013 through CY2015 adjusted to maximize the fit to the data as measured by the R-squared statistic."]
["Composite 2016 to 2019 Curve - based on Medicaid MCO NAIC data for CY2016 through CY2019 adjusted to maximize the fit to the data as measured by the R-squared statistic."]
["MCO Size Curve - calculated using the formula (standard deviation) = 1.8046 x (member months)-.0286  This formula was derived by fitting a curve to the fit-adjusted deciles based on size calculated using the Medicaid MCO NAIC data for CY2013 to CY2019. The size deciles were determined using each MCO member month count."]
["For-Profit Curve - based on Medicaid for-profit MCO NAIC data for CY2013 through CY2019 adjusted to maximize the fit to the data as measured by the R-squared statistic."]
["Not-For-Profit Curve - based on Medicaid not-for-profit MCO NAIC data for CY2013 through CY2019 adjusted to maximize the fit to the data as measured by the R-squared statistic."]
["Expansion Curve - based on Medicaid MCO NAIC data for MCOs operating in Medicaid Expansion states during CY2013 through CY2019 adjusted to maximize the fit to the data as measured by the R-squared statistic."]
["Non-Expansion Curve - based on Medicaid MCO NAIC data for MCOs operating in Medicaid Non-Expansion states during CY2013 through CY2019 adjusted to maximize the fit to the data as measured by the R-squared statistic."]
["User-Defined Curve - based on user provided value from the User Parameters tab."]
[]
["     Premium Development Chart"]
[]
["This pie chart delineates the components of the premium as a percentage of the total base premium."]

{"sheet":"User Parameters","index":2,"n_rows":49,"n_cols":11,"rows_kept":49,"cut":false,"hidden":false,"merged":[[45,0,45,2],[32,4,32,9],[23,4,23,7],[22,4,22,9],[15,0,15,2],[0,1,0,2],[2,0,2,2],[0,6,0,7],[8,4,8,9],[2,4,2,9]]}
["SOA Underwriting Margin Model - USER PARAMETERS","Calculation Is Required",null,null,null,null,"Worksheet UnLocked"]
[]
["General Parameters",null,null,null,"MLR Provisions"]
[" 1. Calculation Target","Risk Margin",0.02,"i","38. Include Minimum MLR, Maximum MLR Provisions on Rates:",null,null,null,null,"No","i"]
[" 2. Average Monthly Enrollment",null,100000,"i","38.a. Minimum MLR",null,null,null,null,0]
[" 3. Months in Rating Period",null,12,"i","38.b. Maximum MLR",null,null,null,null,2]
[" 4. Member Months",null,{"$f":"C5*C6","v":1200000},"i"]
[" 5. UW Margin Curve - Standard Deviation","MCO Size Curve",{"$f":"VLOOKUP(UP_Curve_Name,'Results Dashboard'!A50:C58,3,FALSE)","v":3.29408739094647E-2},"i"]
[" 6. Claims Expense PMPM",null,400,"i","Risk Sharing (RS) Parameters"]
[" 7. Administrative Expenses PMPM",null,40,"i","39. Baseline for Risk Share:",null,null,null,null,"No Risk Share","i"]
[" 8. QI Allowance PMPM",null,0,"i","40. MLR Target, if applicable:",null,null,null,null,0.85]
[" 9. Withhold %",null,0,"i","Gain or Loss","Low Loss Ratio ","41. Intervals","High Loss Ratio","42. MCO Responsibility","State Responsibility"]
["10. Withhold Earned %",null,1,"i","Gain",0,{"$f":"H13-F13","v":0.76999999999999991},{"$f":"F14","v":0.76999999999999991},0.1,{"$f":"1-I13","v":0.9}]
["11. State Premium Tax %",null,0,"i","Gain",{"$f":"+H14-G14","v":0.76999999999999991},0.05,{"$f":"F15","v":0.82},0.6,0.4]
[null,null,null,null,"Gain",{"$f":"+H15-G15","v":0.82},0.03,{"$f":"IF(UP_RSBasis=\"Medical Baseline\",100%,J11)","v":0.85},1,0]
["Cost of Capital (COC) Parameters",null,null,null,"Loss",{"$f":"H15","v":0.85},0.03,{"$f":"G16+F16","v":0.88},1,0]
["Parameters for Risk Based Capital (RBC) Calculation",null,null,null,"Loss",{"$f":"H16","v":0.88},0.05,{"$f":"F17+G17","v":0.93},0.4,0.6]
["12. Minimum RBC Target Threshold",null,2,"i","Loss",{"$f":"H17","v":0.93},{"$f":"H18-F18","v":1.0699999999999998},2,0.1,0.9]
["13. Maximum RBC Target Threshold",null,4.5,"i"]
["14. Discount to apply to RBC between Thresholds",null,0,"i"]
["15. Calculation of Authorized Control Level as % of Premium","NAIC Filings (All)",{"$f":"VLOOKUP(UP_COC_Selection_H0,'Drop Downs'!A85:B88,2,FALSE)","v":3.5029674312779695E-2},"i"]
["16. Selection of NAIC Health Insurer Filings for RBC Risk Factors Weights",null,"Medicaid-Dominant","i"]
["17. Managed Care Discount Factor (applied to Underwriting Risk)",null,{"$f":"J30","v":0.23549999999999999},"i","17. Managed Care Discount for RBC Calculation"]
["Parameters for Weighted Average Cost of Capital (WACC) Calculation",null,null,null,"Categories",null,null,null,"% of Claims","Discount","i"]
["18. State Corporate Tax Rate","Pennsylvania",{"$f":"VLOOKUP(B25,'Tax Rates'!A8:B59,2,FALSE)","v":9.9900000000000003E-2},"i","17.a. Category 0 -  Arrangements not Included in Other Categories",null,null,null,{"$f":"1-SUM(I26:I29)","v":3.0000000000000027E-2},0]
["19. Federal Corporate Tax Rate",null,0.21,"i","17.b. Category 1 -  Payments made according to contractual arrangements",null,null,null,0.75,0.15]
["20. Historical Period for Benchmark Rates of Returns & Betas",null,"5-Year","i","17.c. Category 2a/b -  Payments subject to withhold/bonus",null,null,null,0.02,0.15]
["21. Risk-Free Rate of Return","20-Yr Treasury",{"$f":"VLOOKUP(B28,'Drop Downs'!A14:B17,2,FALSE)","v":2.278852459016394E-2},"i","17.d. Category 3a/b -  Capitated payments to providers/intermediaries",null,null,null,0.2,0.6]
["22.  Equity Risk Premium","Implied Eq. Risk Prem. (Damodaran)",{"$f":"VLOOKUP(B29,'Drop Downs'!A28:B30,2,FALSE)","v":5.3313888888888897E-2},"i","17.e. Category 4 -  Expenses paid as salary to providers",null,null,null,0,0.75]
["---> Expected Market Rate of Return (Informational Only)",null,{"$f":"'Equity Premium'!B13","v":0.12606036725596867},"i","17.f. Composite Managed Care Discount Factor",null,null,null,null,{"$f":"SUMPRODUCT(J25:J29,I25:I29)","v":0.23549999999999999},"i"]
["23. Beta of Benchmark Expected Rate of Return","Select Insurers",{"$f":"VLOOKUP(B31,'Drop Downs'!A21:C24,3,FALSE)","v":0.96817948486192729},"i"]
["24. Calculate Cost of Equity on an After-Tax or Pre-Tax Basis",null,"After-Tax","i"]
["25. Cost of Equity",null,{"$f":"CostOfEquity","v":7.6102413479052833E-2},"i","User-Defined Parameter Inputs",null,null,null,null,null,"i"]
["26. Recognize Debt in Calculation of WACC",null,"No","i","5. General Parameter: User-Defined Curve (Standard Deviation %) …................................................................",null,null,null,null,0.03]
["27. Interest Rate for Debt","Moderate (Proxy: Baa Yield)",{"$f":"VLOOKUP(B35,'Drop Downs'!A8:B10,2,FALSE)","v":4.1129508196721315E-2},"i","15. COC Parameter: Authorized Control Level (ACL) as % of Premium ….......................................................",null,null,null,null,0]
["28. Percent (%) Debt for MCO Debt / Equity Ratio",null,0,"i","18. COC Parameter: State Corporate Tax Rate …................................................................................................",null,null,null,null,0]
["29. Weighted Average Cost of Capital % (WACC %) ",null,{"$f":"(WACC)","v":7.6102413479052833E-2},"i","21. COC Parameter: Risk-Free Rate of Return ….................................................................................................",null,null,null,null,0]
["30. Discount to Cost of Capital (Investment Earnings on Reserves)","No Discount",{"$f":"VLOOKUP(B38,'Drop Downs'!A41:B44,2,FALSE)","v":0},"i","22. COC Parameter: Beta of Benchmark Expected Rate of Return......................................................................",null,null,null,null,1]
["Parameters for Cash Flow",null,null,null,"23. COC Parameter: Equity Risk Premium …........................................................................................................",null,null,null,null,0]
["31. Withhold Lag - Number of Months after Rating Period before Withhold Paid",null,6,"i","27. COC Parameter: Interest Rate for Debt (%) …...............................................................................................",null,null,null,null,0]
["32. Payment Lag -  Number of Months before Monthly Premium Paid",null,2,"i","30. COC Parameter: Discount to Cost of Capital (Investment Earnings on Reserves) …...........................................",null,null,null,null,0]
["33. Factor to Apply to MCO Revenue Lag","None",{"$f":"VLOOKUP(B42,'Drop Downs'!A33:B37,2,FALSE)","v":0},"i","33. COC Parameter: Factor to Apply to MCO Revenue Lag …..............................................................................",null,null,null,null,0]
["34. Claims Lag - Average Claims Payment Lag (in Months)",null,0,"i","36. Income Matrix - Interest Income / Interest Expense: Interest Income on Gains ….........................................",null,null,null,null,0]
["35. Percent (%) of Claims Subject to Claims Payment Lag",null,0,"i","37. Income Matrix - Interest Income / Interest Expense: Interest Expense on Losses …......................................",null,null,null,null,0]
[]
["Income Matrix - Interest Income / Interest Expense"]
["Bin Observation of Gain / Loss","Rate Selection","Rate"]
["36. Interest Income on Gains:","None",{"$f":"IFERROR(VLOOKUP(B48,'Drop Downs'!$A$67:$B$72,2,FALSE),0)","v":0},"i"]
["37. Interest Expense on Losses:","None",{"$f":"IFERROR(VLOOKUP(B49,'Drop Downs'!$A$76:$B$81,2,FALSE),0)","v":0},"i"]

{"sheet":"Results Dashboard","index":3,"n_rows":58,"n_cols":20,"rows_kept":58,"cut":false,"hidden":false,"merged":[[20,0,20,1],[5,14,5,15],[12,0,12,2],[12,4,12,12],[3,0,3,2],[5,0,5,2],[6,0,6,1],[11,4,11,12],[19,0,19,3],[11,14,11,15],[12,14,12,15],[13,14,13,15],[14,14,14,15],[48,0,48,1],[47,3,47,4],[47,5,47,6],[47,7,47,8],[29,0,29,4],[46,0,46,8],[30,0,30,1],[30,6,30,7],[29,6,29,10],[47,0,47,2],[43,0,43,4],[0,4,0,6],[7,14,7,15],[8,14,8,15],[9,14,9,15],[10,14,10,15],[4,4,4,12],[4,14,4,18],[6,14,6,15],[5,4,5,5]]}
["SOA Underwriting Margin Model - RESULTS DASHBOARD",null,null,null,"Calculation Is Required"]
[]
[]
[{"$f":"\"Results Based On \" & 'User Parameters'!B8","v":"Results Based On MCO Size Curve"},null,null,"i"]
[null,null,null,null,"Probability of Ruin by RBC Level",null,null,null,null,null,null,null,null,"i","Gain and Loss Distribution",null,null,null,null,"i"]
[{"$f":"\"Selected Target: \"&UP_Target_Type","v":"Selected Target: Risk Margin"},null,null,"i","RBC Thresholds",null,"RBC %","RBC $M","RBC PMPM","RBC as a % of Premium","Probability of exceeding the  RBC Threshold","Value of Excess Losses as % of Premium","Given a loss, the average loss ($M) in excess of the  RBC Level",null,"Interval",null,"Starting Point","Gain Likelihood","Loss Likelihood"]
["Results",null,{"$f":"IF(UP_Target_Type=\"Probability of Ruin\",\"Probability\",\" % of Premium\")","v":" % of Premium"},null,"Authorized Control Level (ACL)",null,1,{"$f":"I7*'User Parameters'!$C$7","v":19107009.849447679},{"$f":"ACL","v":15.922508207873067},{"$f":"I7/$J$33","v":3.5029674312779695E-2},{"$f":"SUMIF('Net Income Matrix'!$AA$8:$AA$168,\"<= \" & -J7,'Net Income Matrix'!$AD$8:$AD$168)","v":2.4234544787719071E-2},{"$f":"-'Net Income Matrix'!AE5","v":3.1549958286551568E-4},{"$f":"IF(K7=0,0,L7*UP_Enrollment*12*'Results Dashboard'!$J$33/K7)","v":7101016.9752491359},null,"0 - 2%",null,0,{"$f":"SUMIFS('Net Income Matrix'!$AD$8:$AD$168,'Net Income Matrix'!$AA$8:$AA$168,\">=\" & Q7)-SUMIFS('Net Income Matrix'!$AD$8:$AD$168,'Net Income Matrix'!$AA$8:$AA$168,\">\" &Q8)","v":0.19950538529528505},{"$f":"SUMIFS('Net Income Matrix'!$AD$8:$AD$168,'Net Income Matrix'!$AA$8:$AA$168,\"<=\" & -Q7)-SUMIFS('Net Income Matrix'!$AD$8:$AD$168,'Net Income Matrix'!$AA$8:$AA$168,\"<\" & -Q8)","v":0.11669731287426677}]
["Target",null,{"$f":"'User Parameters'!C4","v":0.02},null,"200% of ACL",null,2,{"$f":"I8*'User Parameters'!$C$7","v":38214019.698895358},{"$f":"G8*I7","v":31.845016415746134},{"$f":"I8/$J$33","v":7.0059348625559389E-2},{"$f":"SUMIF('Net Income Matrix'!$AA$8:$AA$168,\"<= \" & -J8,'Net Income Matrix'!$AD$8:$AD$168)","v":1.1997222501739749E-3},{"$f":"-'Net Income Matrix'!AF5","v":1.1873830346632941E-5},{"$f":"IF(K8=0,0,L8*UP_Enrollment*12*'Results Dashboard'!$J$33/K8)","v":5398421.0458077826},null,"2 - 4%",null,0.02,{"$f":"SUMIFS('Net Income Matrix'!$AD$8:$AD$168,'Net Income Matrix'!$AA$8:$AA$168,\">=\" & Q8)-SUMIFS('Net Income Matrix'!$AD$8:$AD$168,'Net Income Matrix'!$AA$8:$AA$168,\">\" &Q9)","v":0.17959642632965617},{"$f":"SUMIFS('Net Income Matrix'!$AD$8:$AD$168,'Net Income Matrix'!$AA$8:$AA$168,\"<=\" & -Q8)-SUMIFS('Net Income Matrix'!$AD$8:$AD$168,'Net Income Matrix'!$AA$8:$AA$168,\"<\" & -Q9)","v":4.7730958201110563E-2}]
["Calculated",null,{"$f":"IF(UP_Target_Type=\"Risk Margin\",'Results Dashboard'!E35,IF(UP_Target_Type=\"Net Income Before Taxes\",'Results Dashboard'!K44,'Results Dashboard'!K11))","v":1.9999389648437498E-2},null,"Minimum RBC Selected",null,{"$f":"UP_COC_RBCMinimum","v":2},{"$f":"I9*'User Parameters'!$C$7","v":38214019.698895358},{"$f":"G9*I7","v":31.845016415746134},{"$f":"I9/$J$33","v":7.0059348625559389E-2},{"$f":"SUMIF('Net Income Matrix'!$AA$8:$AA$168,\"<= \" & -J9,'Net Income Matrix'!$AD$8:$AD$168)","v":1.1997222501739749E-3},{"$f":"-'Net Income Matrix'!AG5","v":1.1873830346632941E-5},{"$f":"IF(K9=0,0,L9*UP_Enrollment*12*'Results Dashboard'!$J$33/K9)","v":5398421.0458077826},null,"4 - 6%",null,0.04,{"$f":"SUMIFS('Net Income Matrix'!$AD$8:$AD$168,'Net Income Matrix'!$AA$8:$AA$168,\">=\" & Q9)-SUMIFS('Net Income Matrix'!$AD$8:$AD$168,'Net Income Matrix'!$AA$8:$AA$168,\">\" &Q10)","v":0.21573186697806657},{"$f":"SUMIFS('Net Income Matrix'!$AD$8:$AD$168,'Net Income Matrix'!$AA$8:$AA$168,\"<=\" & -Q9)-SUMIFS('Net Income Matrix'!$AD$8:$AD$168,'Net Income Matrix'!$AA$8:$AA$168,\"<\" & -Q10)","v":1.364653925817071E-2}]
["Variance",null,{"$f":"C8-C9","v":6.1035156250291434E-7},null,"Maximum RBC Selected",null,{"$f":"UP_COC_RBCMaximum","v":4.5},{"$f":"I10*'User Parameters'!$C$7","v":85981544.322514564},{"$f":"G10*I7","v":71.6512869354288},{"$f":"I10/$J$33","v":0.15763353440750863},{"$f":"SUMIF('Net Income Matrix'!$AA$8:$AA$168,\"<= \" & -J10,'Net Income Matrix'!$AD$8:$AD$168)","v":9.764482998035857E-9},{"$f":"-'Net Income Matrix'!AI5","v":3.6852144512593884E-11},{"$f":"IF(K10=0,0,L10*UP_Enrollment*12*'Results Dashboard'!$J$33/K10)","v":2058591.3328648666},null,"6 - 8%",null,0.06,{"$f":"SUMIFS('Net Income Matrix'!$AD$8:$AD$168,'Net Income Matrix'!$AA$8:$AA$168,\">=\" & Q10)-SUMIFS('Net Income Matrix'!$AD$8:$AD$168,'Net Income Matrix'!$AA$8:$AA$168,\">\" &Q11)","v":0.13798925456993261},{"$f":"SUMIFS('Net Income Matrix'!$AD$8:$AD$168,'Net Income Matrix'!$AA$8:$AA$168,\"<=\" & -Q10)-SUMIFS('Net Income Matrix'!$AD$8:$AD$168,'Net Income Matrix'!$AA$8:$AA$168,\"<\" & -Q11)","v":2.7260286361940802E-3}]
[null,null,null,null,{"$f":"\"Implied Target RBC (incl. \"&(UP_COC_RBCThresholdDiscount*100&\"% Disc.)\")","v":"Implied Target RBC (incl. 0% Disc.)"},null,{"$f":"(UP_COC_RBCMaximum-UP_COC_RBCMinimum)* (1-UP_COC_RBCThresholdDiscount)+UP_COC_RBCMinimum","v":4.5},{"$f":"I11*'User Parameters'!$C$7","v":85981544.322514564},{"$f":"G11*I7","v":71.6512869354288},{"$f":"I11/$J$33","v":0.15763353440750863},{"$f":"SUMIF('Net Income Matrix'!$AA$8:$AA$168,\"<= \" & -J11,'Net Income Matrix'!$AD$8:$AD$168)","v":9.764482998035857E-9},{"$f":"-'Net Income Matrix'!AH5","v":3.6852144512593884E-11},{"$f":"IF(K11=0,0,L11*UP_Enrollment*12*'Results Dashboard'!$J$33/K11)","v":2058591.3328648666},null,"8 - 10%",null,0.08,{"$f":"SUMIFS('Net Income Matrix'!$AD$8:$AD$168,'Net Income Matrix'!$AA$8:$AA$168,\">=\" & Q11)-SUMIFS('Net Income Matrix'!$AD$8:$AD$168,'Net Income Matrix'!$AA$8:$AA$168,\">\" &Q12)","v":6.1721758811871363E-2},{"$f":"SUMIFS('Net Income Matrix'!$AD$8:$AD$168,'Net Income Matrix'!$AA$8:$AA$168,\"<=\" & -Q11)-SUMIFS('Net Income Matrix'!$AD$8:$AD$168,'Net Income Matrix'!$AA$8:$AA$168,\"<\" & -Q12)","v":3.802674730263755E-4}]
[null,null,null,null,{"$f":"\"- Given the Implied Target RBC level of \"&ROUND((G11*100),0)&\"% of ACL, the probability that the RBC equity will be reduced below the selected Minimum RBC of \"&UP_COC_RBCMinimum*100&\"% of ACL is \"&ROUND((SUMIF('Net Income Matrix'!$AA$8:$AA$168,\"<= \" & -(J11-J9),'Net Income Matrix'!$AD$8:$AD$168)*100),3)&\"%\"","v":"- Given the Implied Target RBC level of 450% of ACL, the probability that the RBC equity will be reduced below the selected Minimum RBC of 200% of ACL is 0.024%"},null,null,null,null,null,null,null,null,null,"10 - 12%",null,0.1,{"$f":"SUMIFS('Net Income Matrix'!$AD$8:$AD$168,'Net Income Matrix'!$AA$8:$AA$168,\">=\" & Q12)-SUMIFS('Net Income Matrix'!$AD$8:$AD$168,'Net Income Matrix'!$AA$8:$AA$168,\">\" &Q13)","v":1.9299974360136085E-2},{"$f":"SUMIFS('Net Income Matrix'!$AD$8:$AD$168,'Net Income Matrix'!$AA$8:$AA$168,\"<=\" & -Q12)-SUMIFS('Net Income Matrix'!$AD$8:$AD$168,'Net Income Matrix'!$AA$8:$AA$168,\"<\" & -Q13)","v":3.7020171611449804E-5}]
["Underwriting Margin",null,null,"i",{"$f":"\"- Given the Implied Target RBC level of \"&ROUND((G11*100),0)&\"% of ACL, the probability that the RBC equity will be reduced below the 200% of ACL level is \"&ROUND((SUMIF('Net Income Matrix'!$AA$8:$AA$168,\"<= \" & -(J11-J8),'Net Income Matrix'!$AD$8:$AD$168)*100),3)&\"%\"","v":"- Given the Implied Target RBC level of 450% of ACL, the probability that the RBC equity will be reduced below the 200% of ACL level is 0.024%"},null,null,null,null,null,null,null,null,null,"12 - 14%",null,0.12,{"$f":"SUMIFS('Net Income Matrix'!$AD$8:$AD$168,'Net Income Matrix'!$AA$8:$AA$168,\">=\" & Q13)-SUMIFS('Net Income Matrix'!$AD$8:$AD$168,'Net Income Matrix'!$AA$8:$AA$168,\">\" &Q14)","v":4.2171007764451041E-3},{"$f":"SUMIFS('Net Income Matrix'!$AD$8:$AD$168,'Net Income Matrix'!$AA$8:$AA$168,\"<=\" & -Q13)-SUMIFS('Net Income Matrix'!$AD$8:$AD$168,'Net Income Matrix'!$AA$8:$AA$168,\"<\" & -Q14)","v":2.5136395378122802E-6}]
["Components","PMPM","% of Premium",null,null,null,null,null,null,null,null,null,null,null,"14% or More",null,0.14000000000000001,{"$f":"SUMIFS('Net Income Matrix'!$AD$8:$AD$168,'Net Income Matrix'!$AA$8:$AA$168,\">=\" & Q14)","v":7.1746965113722583E-4},{"$f":"SUMIFS('Net Income Matrix'!$AD$8:$AD$168,'Net Income Matrix'!$AA$8:$AA$168,\"<=\" & -Q14)","v":1.2297355229155315E-7}]
["Risk Margin",{"$f":"C15*'Results Dashboard'!D42","v":9.0905911081657624},{"$f":"Macro_Risk_Margin","v":1.9999389648437498E-2},null,null,null,null,null,null,null,null,null,null,"i","Total Likelihood",null,null,{"$f":"SUM(R7:R14)","v":0.81877923677253017},{"$f":"SUM(S7:S14)","v":0.18122076322747008}]
["Cost of Capital",{"$f":"C16*'Results Dashboard'!D42","v":5.4528358646662589},{"$f":"'Macro Populated Cells'!F11","v":1.1996292413644723E-2},null,null,"Total Loss of RBC/Equity",-0.14000000000000001,0,null,null,null,null,null,null,"Expected Gain/Loss, Given a Gain or a Loss",null,null,{"$f":"IF(R15=0,0,SUMPRODUCT('Net Income Matrix'!$AD$8:$AD$168,'Net Income Matrix'!$AA$8:$AA$168,--('Net Income Matrix'!$AA$8:$AA$168>=0))/R15)","v":4.3171003239242917E-2},{"$f":"IF(S15=0,0,SUMPRODUCT('Net Income Matrix'!$AD$8:$AD$168,'Net Income Matrix'!$AA$8:$AA$168,--('Net Income Matrix'!$AA$8:$AA$168<0))/S15)","v":-1.8495888446526117E-2}]
["UW Margin",{"$f":"B15+B16","v":14.543426972832021},{"$f":"Dash_Risk_Margin+C16","v":3.1995682062082219E-2},null,null,null,null,null,null,null,null,null,null,null,"Net Income Before Taxes",null,null,null,{"$f":"R16*R15+S15*S16","v":3.1995682062082136E-2}]
[]
[null,null,null,null,null,null,null,null,null,null,null,null,null,null,null,null,null,null,null,"i"]
["Underwriting Margin Accounting",null,null,null,"i"]
["Components",null,"PMPM","% of Premium"]
["UW Margin",null,{"$f":"B17","v":14.543426972832021},{"$f":"C17","v":3.1995682062082219E-2}]
["Withhold Not Achieved",null,{"$f":"D23*'Results Dashboard'!$D$42","v":0},{"$f":"-'Net Income Matrix'!Z5","v":0}]
["Net Transfer Payments (Min/Max MLR)",null,{"$f":"D24*'Results Dashboard'!$D$42","v":0},{"$f":"-'Net Income Matrix'!W5","v":0}]
["Risk Sharing Adjustments",null,{"$f":"D25*'Results Dashboard'!$D$42","v":0},{"$f":"-'Net Income Matrix'!S5/'Net Income Matrix'!B5","v":0}]
["Net Cost of Capital Infusions",null,{"$f":"D26*'Results Dashboard'!$D$42","v":0},{"$f":"'Net Income Matrix'!Y5","v":0}]
["Net Income Before Taxes",null,{"$f":"D27*'Results Dashboard'!$D$42","v":14.543426972832021},{"$f":"D22+SUM(D23:D26)","v":3.1995682062082219E-2}]
[]
[]
["Premium Development and Cost of Capital Detail",null,null,null,null,"i","Income Statement",null,null,null,null,null,"i"]
["Premium Component",null,"$M","PMPM","% of Premium",null,"Statement Entries",null,"$M","PMPM","% of Premium"]
["Claims Expense",null,{"$f":"D32*'User Parameters'!$C$7","v":480000000},{"$f":"'User Parameters'!C9","v":400},{"$f":"D32/D42","v":0.88000392539810701},null,"Revenue"]
["Admin Expense",null,{"$f":"D33*'User Parameters'!$C$7","v":48000000},{"$f":"'User Parameters'!C10","v":40},{"$f":"D33/D42","v":8.8000392539810707E-2},null,"Premium (Incl. UW Margin)",null,{"$f":"J33*'User Parameters'!$C$7","v":545452112.3673985},{"$f":"'Results Dashboard'!D42","v":454.54342697283204},{"$f":"J33/'Results Dashboard'!$D$42","v":1}]
["Premium Tax",null,{"$f":"D34*'User Parameters'!$C$7","v":0},{"$f":"E34*D42","v":0},{"$f":"'User Parameters'!C14","v":0},null,"Withhold Unachieved",null,{"$f":"J34*'User Parameters'!$C$7","v":0},{"$f":"K34*$J$33","v":0},{"$f":"D23","v":0}]
["Risk Margin",null,{"$f":"D35*'User Parameters'!$C$7","v":10908709.329798914},{"$f":"E35*D42","v":9.0905911081657624},{"$f":"'Macro Populated Cells'!F12","v":1.9999389648437498E-2},null,"Net Transfer Payments",null,{"$f":"J35*'User Parameters'!$C$7","v":0},{"$f":"K35*$J$33","v":0},{"$f":"D24","v":0}]
["Cost of Capital",null,null,null,null,null,"Total Revenue",null,{"$f":"J36*'User Parameters'!$C$7","v":545452112.3673985},{"$f":"SUM(J33:J35)","v":454.54342697283204},{"$f":"SUM(K33:K35)","v":1}]
["Cost of RBC Target",null,{"$f":"D37*'User Parameters'!$C$7","v":6543403.0375995105},{"$f":"E37*$D$42","v":5.4528358646662589},{"$f":"'COC Calculation'!C86","v":1.1996292413644723E-2},null,"Expenses"]
["Withholds Payment Delay",null,{"$f":"D38*'User Parameters'!$C$7","v":0},{"$f":"E38*$D$42","v":0},{"$f":"'COC Calculation'!C99","v":0},null,"Claims",null,{"$f":"J38*'User Parameters'!$C$7","v":480000000},{"$f":"'User Parameters'!C9","v":400},{"$f":"J38/'Results Dashboard'!$D$42","v":0.88000392539810701},null,null,null,null,null,null,null,null,"i"]
["Premium Payment Delay",null,{"$f":"D39*'User Parameters'!$C$7","v":0},{"$f":"E39*$D$42","v":0},{"$f":"'COC Calculation'!C105","v":0},null,"Administration",null,{"$f":"J39*'User Parameters'!$C$7","v":48000000},{"$f":"'User Parameters'!C10","v":40},{"$f":"J39/'Results Dashboard'!$D$42","v":8.8000392539810707E-2}]
["Claims Lag",null,{"$f":"D40*'User Parameters'!$C$7","v":0},{"$f":"E40*$D$42","v":0},{"$f":"COC_Cost_Claim_Delay","v":0},null,"Premium Tax",null,{"$f":"J40*'User Parameters'!$C$7","v":0},{"$f":"'Results Dashboard'!D42*'User Parameters'!C14","v":0},{"$f":"J40/'Results Dashboard'!$D$42","v":0}]
["Subtotal Cost of Capital",null,{"$f":"D41*'User Parameters'!$C$7","v":6543403.0375995105},{"$f":"SUM(D37:D40)","v":5.4528358646662589},{"$f":"C41/'Results Dashboard'!$I$33","v":1.1996292413644721E-2},null,"Risk Sharing Adjustments",null,{"$f":"J41*'User Parameters'!$C$7","v":0},{"$f":"K41*$J$33","v":0},{"$f":"-D25","v":0}]
["Base Premium",null,{"$f":"D42*'User Parameters'!$C$7","v":545452112.3673985},{"$f":"SUM(D32:D33)/(1-'Macro Populated Cells'!F13-'User Parameters'!C14)","v":454.54342697283204},{"$f":"D42/D42","v":1},null,"Net Cost of Capital Infusions",null,{"$f":"J42*'User Parameters'!$C$7","v":0},{"$f":"K42*$J$33","v":0},{"$f":"-D26","v":0}]
["Minimum Loss Ratio - CMS Definition",null,null,null,{"$f":"'Net Income Matrix'!I5","v":0.88000392539810757},null,"Total Expenses",null,{"$f":"J43*'User Parameters'!$C$7","v":528000000},{"$f":"SUM(J38:J42)","v":440},{"$f":"J43/'Results Dashboard'!$D$42","v":0.96800431793791775}]
[null,null,null,null,null,null,"Net Income Before Taxes",null,{"$f":"J44*'User Parameters'!$C$7","v":17452112.367398445},{"$f":"J36-J43","v":14.543426972832037},{"$f":"J44/'Results Dashboard'!$D$42","v":3.1995682062082254E-2}]
[]
[]
[{"$f":"\"Analysis of Underwriting Margin Curves        \"&\" \"&A6&\" = \"&Dash_Target*100&\"% of Premium\"","v":"Analysis of Underwriting Margin Curves         Selected Target: Risk Margin = 2% of Premium"},null,null,null,null,null,null,null,null,"i"]
["Curves",null,null,"Risk Margin",null,"Probability of Ruin",null,"Likelihood of Loss"]
[null,null,"Stand Dev.","% of Prem.","High/ Low","%","High/ Low","%","High/ Low"]
["Composite 2013 to 2019 Curve",null,3.7144889249174973E-2,1.9999389648437498E-2,{"$f":"IF(D50=MIN($D$50:$D$58),\"Low\",IF(D50=MAX($D$50:$D$58),\"High\",\"\"))","v":"Low"},3.1710634709401499E-7,{"$f":"IF(F50=MIN($F$50:$F$58),\"Low\",IF(F50=MAX($F$50:$F$58),\"High\",\"\"))","v":""},0.20964658834492153,{"$f":"IF(H50=MIN($H$50:$H$58),\"Low\",IF(H50=MAX($H$50:$H$58),\"High\",\"\"))","v":""}]
["Composite 2013 to 2015 Curve",null,3.8920096212363517E-2,1.9999389648437498E-2,{"$f":"IF(D51=MIN($D$50:$D$58),\"Low\",IF(D51=MAX($D$50:$D$58),\"High\",\"\"))","v":"Low"},1.0004745266855119E-6,{"$f":"IF(F51=MIN($F$50:$F$58),\"Low\",IF(F51=MAX($F$50:$F$58),\"High\",\"\"))","v":""},0.22040977465809239,{"$f":"IF(H51=MIN($H$50:$H$58),\"Low\",IF(H51=MAX($H$50:$H$58),\"High\",\"\"))","v":""}]
["Composite 2016 to 2019 Curve",null,3.5290503251745854E-2,1.9999389648437498E-2,{"$f":"IF(D52=MIN($D$50:$D$58),\"Low\",IF(D52=MAX($D$50:$D$58),\"High\",\"\"))","v":"Low"},7.9335112983794845E-8,"",0.19763834387638157,""]
["MCO Size Curve",null,{"$f":"1.8046*UP_MemberMonths^-0.286","v":3.29408739094647E-2},1.9999389648437498E-2,"Low",9.764482998035857E-9,"",0.18122076322747008,""]
["For-Profit Curve",null,3.9807089688944627E-2,1.9999389648437498E-2,"Low",1.6806160607029805E-6,"High",0.2255343319783962,"High"]
["Not-For-Profit Curve",null,3.3644676887853511E-2,1.9999389648437498E-2,"Low",1.9136471561873778E-8,"",0.18628451297552634,""]
["Expansion Curve",null,3.6163310014009534E-2,1.9999389648437498E-2,"Low",1.5630454052457173E-7,"",0.20339094937713942,""]
["Non-Expansion Curve",null,3.8943381404281607E-2,1.9999389648437498E-2,"Low",1.0146401954212587E-6,"",0.22054641001392108,""]
["User-Defined Curve",null,{"$f":"'User Parameters'!J34","v":0.03},1.9999389648437498E-2,"Low",3.4872326508212304E-10,"Low",0.15865525393145777,"Low"]

{"sheet":"Graphs","index":4,"n_rows":62,"n_cols":9,"rows_kept":62,"cut":false,"hidden":false,"merged":[[19,1,19,4],[4,1,4,4],[52,1,52,4],[53,1,53,2],[54,1,54,2],[57,1,57,2],[56,1,56,2],[58,1,58,2],[59,1,59,2],[20,1,20,2],[55,1,55,2]]}
[]
[]
[]
[]
[null,"Probability of Ruin by RBC Level"]
[null,"RBC Thresholds","RBC %","RBC % of Prem","Probability > RBC"]
[null,{"$f":"'Results Dashboard'!E7","v":"Authorized Control Level (ACL)"},{"$f":"'Results Dashboard'!G7","v":1},{"$f":"'Results Dashboard'!J7","v":3.5029674312779695E-2},{"$f":"'Results Dashboard'!K7","v":2.4234544787719071E-2}]
[null,{"$f":"'Results Dashboard'!E8","v":"200% of ACL"},{"$f":"'Results Dashboard'!G8","v":2},{"$f":"'Results Dashboard'!J8","v":7.0059348625559389E-2},{"$f":"'Results Dashboard'!K8","v":1.1997222501739749E-3}]
[null,{"$f":"'Results Dashboard'!E9","v":"Minimum RBC Selected"},{"$f":"'Results Dashboard'!G9","v":2},{"$f":"'Results Dashboard'!J9","v":7.0059348625559389E-2},{"$f":"'Results Dashboard'!K9","v":1.1997222501739749E-3}]
[null,{"$f":"'Results Dashboard'!E11","v":"Implied Target RBC (incl. 0% Disc.)"},{"$f":"'Results Dashboard'!G11","v":4.5},{"$f":"'Results Dashboard'!J11","v":0.15763353440750863},{"$f":"'Results Dashboard'!K11","v":9.764482998035857E-9}]
[null,{"$f":"'Results Dashboard'!E10","v":"Maximum RBC Selected"},{"$f":"'Results Dashboard'!G10","v":4.5},{"$f":"'Results Dashboard'!J10","v":0.15763353440750863},{"$f":"'Results Dashboard'!K10","v":9.764482998035857E-9}]
[]
[]
[]
[]
[]
[]
[]
[]
[null,"Income Statement",null,null,null,null,null,{"$f":"B23","v":"Premium"},{"$f":"D23","v":545452112.3673985}]
[null,"Statement Entries",null,"$M","% of Premium",null,null,{"$f":"B24","v":"Withhold Unachieved"},{"$f":"D24","v":0}]
[null,"Revenue",null,null,null,null,null,{"$f":"B25","v":"Net Transfer Payments"},{"$f":"D25","v":0}]
[null,"Premium",null,{"$f":"'Results Dashboard'!I33","v":545452112.3673985},{"$f":"D23/$D$23","v":1}]
[null,"Withhold Unachieved",null,{"$f":"'Results Dashboard'!I34","v":0},{"$f":"D24/$D$23","v":0}]
[null,"Net Transfer Payments",null,{"$f":"'Results Dashboard'!I35","v":0},{"$f":"D25/$D$23","v":0},null,null,{"$f":"B28","v":"Claims"},{"$f":"D28*-1","v":-480000000}]
[null,"Total Revenue",null,{"$f":"SUM(D23:D25)","v":545452112.3673985},{"$f":"D26/$D$23","v":1},null,null,{"$f":"B29","v":"Administration"},{"$f":"D29*-1","v":-48000000}]
[null,"Expenses",null,null,null,null,null,{"$f":"B30","v":"Premium Tax"},{"$f":"D30*-1","v":0}]
[null,"Claims",null,{"$f":"'Results Dashboard'!I38","v":480000000},{"$f":"D28/$D$23","v":0.8800039253981069},null,null,{"$f":"B31","v":"Risk Sharing Adjustments"},{"$f":"D31*-1","v":0}]
[null,"Administration",null,{"$f":"'Results Dashboard'!I39","v":48000000},8.8000392539810693E-2,null,null,{"$f":"B32","v":"Cost of Capital Infusions"},{"$f":"D32*-1","v":0}]
[null,"Premium Tax",null,{"$f":"'Results Dashboard'!I40","v":0},0]
[null,"Risk Sharing Adjustments",null,{"$f":"'Results Dashboard'!I41","v":0},0,null,null,{"$f":"B34","v":"Net Income Before Taxes"},{"$f":"D34","v":17452112.367398445}]
[null,"Cost of Capital Infusions",null,{"$f":"'Results Dashboard'!I42","v":0},0]
[null,"Total Expenses",null,{"$f":"'Results Dashboard'!I43","v":528000000},0.96800431793791764]
[null,"Net Income Before Taxes",null,{"$f":"'Results Dashboard'!I44","v":17452112.367398445},3.1995682062082254E-2]
[]
[]
[]
[]
[]
[]
[]
[]
[]
[]
[]
[]
[]
[]
[]
[]
[]
[]
[null,"Premium Development"]
[null,"Premium Component",null,"PMPM","% of Premium"]
[null,"Claims Expense",null,{"$f":"'Results Dashboard'!D32","v":400},{"$f":"D55/$D$60","v":0.88000392539810701}]
[null,"Admin Expense",null,{"$f":"'Results Dashboard'!D33","v":40},{"$f":"D56/$D$60","v":8.8000392539810707E-2}]
[null,"Premium Tax",null,{"$f":"'Results Dashboard'!D34","v":0},{"$f":"D57/$D$60","v":0}]
[null,"Risk Margin",null,{"$f":"'Results Dashboard'!D35","v":9.0905911081657624},{"$f":"D58/$D$60","v":1.9999389648437498E-2}]
[null,"Cost of Capital",null,{"$f":"'Results Dashboard'!D41","v":5.4528358646662589},{"$f":"D59/$D$60","v":1.1996292413644723E-2}]
[null,"Base Premium",null,{"$f":"SUM(D55:D59)","v":454.54342697283204},{"$f":"SUM(E55:E59)","v":1}]
[null,"Underwriting Margin (before taxes)",null,{"$f":"D60-D55-D56-D57","v":14.543426972832037},{"$f":"D61/$D$60","v":3.1995682062082254E-2}]
[null,"Required Capital (200% ACL RBC)",null,{"$f":"'Results Dashboard'!I8","v":31.845016415746134},{"$f":"D62/$D$60","v":7.0059348625559389E-2}]

{"sheet":"COC Calculation","index":5,"n_rows":115,"n_cols":44,"rows_kept":115,"cut":false,"hidden":false,"merged":[[0,0,0,5],[45,0,45,5],[70,0,70,5],[80,0,80,5],[86,0,86,5],[1,0,1,5],[112,0,112,5],[8,0,8,5],[12,0,12,5],[20,0,20,5],[28,0,28,5],[48,0,48,5],[53,0,53,5],[66,0,66,5],[87,0,87,5],[99,0,99,5],[105,0,105,5],[11,0,11,5],[39,0,39,5],[42,0,42,5]]}
["Cost of Capital Calculation"]
["Shared Inputs:"]
["Member Months",null,{"$f":"UP_Enrollment*UP_MonthsInRatingPeriod","v":1200000},null,{"$f":"_xlfn.FORMULATEXT(C3)","v":"=UP_Enrollment*UP_MonthsInRatingPeriod"},"user parameter - Average Monthly Enrollment × Months in Rating Period"]
["Base Medical PMPM",null,{"$f":"UP_Medical_PMPM","v":400},null,"=UP_Medical_PMPM","user parameter - Medical Component PMPM"]
["Base Administrative PMPM",null,{"$f":"UP_Administrative_PMPM","v":40},null,"=UP_Administrative_PMPM","user parameter - Administrative Component PMPM (excl. UW margin or taxes)"]
["Base Premium PMPM (before taxes)",null,{"$f":"Results_Premium","v":454.54342697283204},null,"=Results_Premium","calculated - Base PMPM"]
["Gross Claims",null,{"$f":"C3*C4","v":480000000},null,{"$f":"_xlfn.FORMULATEXT(C7)","v":"=C3*C4"}]
["Gross Premium",null,{"$f":"C3*C6","v":545452112.3673985},null,{"$f":"_xlfn.FORMULATEXT(C8)","v":"=C3*C6"}]
["Step 1. Determine Authorized Control Level"]
["ACL Determination Methodology",null,{"$f":"UP_COC_Selection_H0","v":"NAIC Filings (All)"},null,null,"user input"]
["Selection Criteria for Weights Risk Factors",null,{"$f":"UP_COC_Selection_H4","v":"Medicaid-Dominant"},null,null,"user input"]
["Step 1.a. - If ACL Determination Methodology = \"NAIC Filings + User Parameters\""]
["Step 1.a.1. Calculate H2 - Underwriting Risk"]
["Calculate Underwriting Risk Factor:"]
["Claims under $25,000,000",null,0.14929999999999999,null,null,"Source: NAIC Capital Adequacy Task Force - Adopted 6/30/2021"]
["Claims over $25,000,000",null,8.9300000000000004E-2,null,null,"Source: NAIC Capital Adequacy Task Force - Adopted 6/30/2021"]
["Composite UW RBC Factor",null,{"$f":"(MIN(25000000,C$8)*C15+MAX(0,C$8-25000000)*C16)/C$8","v":9.2050012266869097E-2},null,{"$f":"_xlfn.FORMULATEXT(C17)","v":"=(MIN(25000000,C$8)*C15+MAX(0,C$8-25000000)*C16)/C$8"},"Line 10.3 from RBC Model"]
["Managed Care Discount Factor",null,{"$f":"1-UP_COC_ManagedCareDiscount","v":0.76449999999999996},null,{"$f":"_xlfn.FORMULATEXT(C18)","v":"=1-UP_COC_ManagedCareDiscount"},"user input - calculated \"Managed Care Discount Factor\""]
["Base Underwriting RBC Factor after Managed Care Discount",null,{"$f":"C17*C18","v":7.0372234378021425E-2},null,{"$f":"_xlfn.FORMULATEXT(C19)","v":"=C17*C18"}]
["H2 - Underwriting Risk",null,{"$f":"C4*C19","v":28.148893751208568},null,{"$f":"_xlfn.FORMULATEXT(C20)","v":"=C4*C19"}]
["Step 1.a.2. Calculate H4 - Business Risk"]
["Calculate Business Risk Factor:"]
["Premiums under $25,000,000",null,7.0000000000000007E-2]
["Premiums over $25,000,000",null,0.04]
["Composite Business Risk Factor",null,{"$f":"(MIN(25000000,C$8)*C23+MAX(0,C$8-25000000)*C24)/C$8","v":4.137500613343454E-2},null,{"$f":"_xlfn.FORMULATEXT(C25)","v":"=(MIN(25000000,C$8)*C23+MAX(0,C$8-25000000)*C24)/C$8"}]
["\"Calculated\" H4 - Business Risk",null,{"$f":"C5*C25","v":1.6550002453373815},null,{"$f":"_xlfn.FORMULATEXT(C26)","v":"=C5*C25"},"calculated using user-provided administrative PMPM"]
["\"Imputed\" H4 - Business Risk",null,{"$f":"_H2*'RBC Weights'!B10","v":2.0864401931814527},null,{"$f":"_xlfn.FORMULATEXT(C27)","v":"=_H2*'RBC Weights'!B10"},"average weight of H4 relative to H2"]
["Average H4 - Business Risk",null,{"$f":"AVERAGE(C26:C27)","v":1.8707202192594172}]
["Step 1.a.3. Calculate Authorized Control Level"]
["Authorized Control Level for Risk Based Capital Before Basic Operational Risk ="]
["H0 - Asset Risk - Affiliates with RBC",null,{"$f":"_H2*'RBC Weights'!B6","v":0.71320745791297335},null,{"$f":"_xlfn.FORMULATEXT(C31)","v":"=_H2*'RBC Weights'!B6"},"average weight of H0 relative to H2"]
["H1 - Asset Risk - Other",null,{"$f":"_H2*'RBC Weights'!B7","v":2.3907403433042553},null,"=_H2*'RBC Weights'!B7","average weight of H1 relative to H2"]
["H2 - Underwriting Risk",null,{"$f":"_H2","v":28.148893751208568},null,"=_H2"]
["H3 - Credit Risk",null,{"$f":"_H2*'RBC Weights'!B9","v":1.5205914377311422},null,"=_H2*'RBC Weights'!B9","average weight of H3 relative to H2"]
["H4 - Business Risk",null,{"$f":"_H4_Average","v":1.8707202192594172},null,"=_H4_Average","average H4"]
["RBC after Covariance Before Basic Operational Risk",null,{"$f":"(_H0+SUM(_H1^2+_H2^2+_H3^2+_H4^2)^(1/2))","v":29.066120029025992},null,"=(_H0+SUM(_H1^2+_H2^2+_H3^2+_H4^2)^(1/2))"]
["Basic Operational Risk",null,0.03]
["Calculated Authorized Control Level RBC",null,{"$f":"(1/2)*(1+RBC_Operational_Risk)*RBC_After_Covariance","v":14.969051814948386},null,{"$f":"_xlfn.FORMULATEXT(C38)","v":"=(1/2)*(1+RBC_Operational_Risk)*RBC_After_Covariance"}]
["Calculated ACL as % of Premium",null,{"$f":"C38/COC_Premium","v":3.2932060891605594E-2},null,"=C38/COC_Premium"]
["Step 1.b. - Alternate ACL (If ACL Determination Methodology <> \"NAIC Filings + User Parameters\")"]
["Alternate ACL as % of Premium",null,{"$f":"IF(C10<>\"NAIC Filings + User Parameters\",'User Parameters'!C21,0)","v":3.5029674312779695E-2},null,{"$f":"_xlfn.FORMULATEXT(C41)","v":"=IF(C10<>\"NAIC Filings + User Parameters\",'User Parameters'!C21,0)"}]
["Alternate Authorized Control Level RBC",null,{"$f":"COC_Premium*C41","v":15.922508207873067},null,"=COC_Premium*C41"]
["Step 1.c. Selected ACL"]
["Selected Authorized Control Level RBC",null,{"$f":"IF(C10=\"NAIC Filings + User Parameters\",COC_Calc_ACL,COC_Calc_Alt_ACL)","v":15.922508207873067},null,{"$f":"_xlfn.FORMULATEXT(C44)","v":"=IF(C10=\"NAIC Filings + User Parameters\",COC_Calc_ACL,COC_Calc_Alt_ACL)"}]
["Selected ACL as % of Premium",null,{"$f":"ACL/COC_Premium","v":3.5029674312779695E-2},null,{"$f":"_xlfn.FORMULATEXT(C45)","v":"=ACL/COC_Premium"}]
["Step 2. Calculate Weighted Average Cost of Capital"]
["Federal Corporate Tax Rate",null,{"$f":"UP_COC_FederalTaxRate","v":0.21},null,{"$f":"_xlfn.FORMULATEXT(C47)","v":"=UP_COC_FederalTaxRate"},"top marginal tax rate (federal)"]
["State Corporate Tax Rate",null,{"$f":"UP_COC_StateTaxRate","v":9.9900000000000003E-2},null,{"$f":"_xlfn.FORMULATEXT(C48)","v":"=UP_COC_StateTaxRate"},"top marginal tax rate for user-selected state"]
["Step 2.a. Calculate Cost of Debt"]
["Recognize Debt in Cost of Capital Calculation",null,{"$f":"UP_COC_Selection_RecognizeDebt","v":"No"},null,null,"user input"]
["Average Interest Rate for Debt: Source",null,{"$f":"UP_COC_Selection_InterestRate","v":"Moderate (Proxy: Baa Yield)"},null,null,"user input"]
["Average Interest Rate for Debt %",null,{"$f":"UP_COC_InterestRate","v":4.1129508196721315E-2},null,{"$f":"_xlfn.FORMULATEXT(C52)","v":"=UP_COC_InterestRate"},"from user-selected interest rate"]
["Cost of Debt",null,{"$f":"interestRate*(1-federalTax-stateTax)","v":2.838347360655738E-2},null,{"$f":"_xlfn.FORMULATEXT(C53)","v":"=interestRate*(1-federalTax-stateTax)"}]
["Step 2.b. Calculate Cost of Equity:"]
["Tax Treatment of Cost of Equity",null,{"$f":"UP_COC_TaxTreatment","v":"After-Tax"}]
["Risk Free Rate",null,{"$f":"UP_COC_Selection_RiskFreeRate","v":"20-Yr Treasury"},null,null,"user input"]
["Benchmark Expected Rate of Return",null,{"$f":"VLOOKUP(UP_COC_Selection_ExpectedRate,'Drop Downs'!A21:B24,2,FALSE)","v":0.15962362008747938}]
["Risk Free Rate of Return",null,{"$f":"UP_COC_RiskFreeRate","v":2.278852459016394E-2},null,null,"from user-selected metric for risk-free rate of return"]
["Calculation of Market Risk Premium",null,{"$f":"UP_COC_EquityMethodology","v":"Implied Eq. Risk Prem. (Damodaran)"}]
["Market Rate of Return",null,{"$f":"'Drop Downs'!B21","v":0.12606036725596867},null,null,"from user-selected metric for expected return"]
["Beta of Benchmark Expected Rate of Return",null,{"$f":"UP_COC_Beta","v":0.96817948486192729},null,null,"from user-selected metric for Beta"]
["Equity Risk Premium",null,{"$f":"IF(C59=\"CAPM Calculated\",B*((E_Rm)-(Rf)),'User Parameters'!C29)","v":5.3313888888888897E-2},null,{"$f":"CONCATENATE(\"Ke\")&_xlfn.FORMULATEXT(C62)","v":"Ke=IF(C59=\"CAPM Calculated\",B*((E_Rm)-(Rf)),'User Parameters'!C29)"}]
["Cost of Equity After-Tax",null,{"$f":"C62+Rf","v":7.6102413479052833E-2},null,{"$f":"CONCATENATE(\"Ke\")&_xlfn.FORMULATEXT(C63)","v":"Ke=C62+Rf"}]
["After-Tax Yield",null,{"$f":"(1-(federalTax+stateTax*(1-federalTax)))","v":0.71107900000000002},null,{"$f":"_xlfn.FORMULATEXT(C64)","v":"=(1-(federalTax+stateTax*(1-federalTax)))"}]
["Cost of Equity Pre-Tax",null,{"$f":"Ke/afterTaxYield","v":0.10702385175072367},null,{"$f":"_xlfn.FORMULATEXT(C65)","v":"=Ke/afterTaxYield"}]
["Selected Cost of Equity",null,{"$f":"IF(C55=\"After-Tax\",Ke,Ke_PreTax)","v":7.6102413479052833E-2}]
["Step 2.c. Weighted Average Cost of Capital"]
["% Debt",null,{"$f":"UP_COC_PercentDebt","v":0},null,null,"user input - % of Debt"]
["% Equity",null,{"$f":"1-C68","v":1},null,{"$f":"_xlfn.FORMULATEXT(C69)","v":"=1-C68"}]
[{"$f":"CONCATENATE(\"Weighted Average Cost of Capital\"&IF(C50=\"No\",\" Adjusted for Exclusion of Debt\",\"\"))","v":"Weighted Average Cost of Capital Adjusted for Exclusion of Debt"},null,{"$f":"IF(C50=\"yes\",C68*C53,0)+C69*C66","v":7.6102413479052833E-2},null,{"$f":"_xlfn.FORMULATEXT(C70)","v":"=IF(C50=\"yes\",C68*C53,0)+C69*C66"}]
["Step 3. Apply WACC to Target RBC"]
["Authorized Control Level (ACL) RBC",null,{"$f":"ACL","v":15.922508207873067},null,{"$f":"_xlfn.FORMULATEXT(C72)","v":"=ACL"}]
["Minimum RBC %",null,{"$f":"UP_COC_RBCMinimum","v":2},null,null,"user input - Minimum RBC"]
["Minimum Target RBC",null,{"$f":"ACL*C73","v":31.845016415746134},null,"=ACL*C73"]
["Maximum RBC %",null,{"$f":"UP_COC_RBCMaximum","v":4.5},null,null,"user input - Maximum RBC"]
["Additional RBC",null,{"$f":"ACL*(C75-C73)","v":39.80627051968267},null,"=ACL*(C75-C73)"]
["Discount to COC on RBC between Min & Max RBC Thresholds",null,{"$f":"UP_COC_RBCThresholdDiscount","v":0},null,"=UP_COC_RBCThresholdDiscount","user input - factor for discounting the cost of capital on RBC between Min and Max Target RBC thresholds"]
["Effective RBC to Finance",null,{"$f":"RBC_LowerThreshold+RBC_UpperThreshold*(1-RBC_ThresholdDiscount)","v":71.6512869354288},null,"=RBC_LowerThreshold+RBC_UpperThreshold*(1-RBC_ThresholdDiscount)"]
["Cost of Capital PMPM",null,{"$f":"C78*WACC","v":5.4528358646662589},null,"=C78*WACC"]
["Cost of Capital as %",null,{"$f":"C79/COC_Premium","v":1.1996292413644723E-2},null,"=C79/COC_Premium"]
["Step 4. Apply a Discount to Cost of Capital for Investment Income",null,"TBD",null,null,null,null,"Calculation of Interest accrued on Withhold"]
["Discounting Methodology",null,{"$f":"UP_COC_Selection_COCDiscountRate","v":"No Discount"},null,{"$f":"_xlfn.FORMULATEXT(C82)","v":"=UP_COC_Selection_COCDiscountRate"},null,null,"Month No.",1,{"$f":"IF(I82<UP_MonthsInRatingPeriod,I82+1,\"\")","v":2},{"$f":"IF(J82<UP_MonthsInRatingPeriod,J82+1,\"\")","v":3},{"$f":"IF(K82<UP_MonthsInRatingPeriod,K82+1,\"\")","v":4},{"$f":"IF(L82<UP_MonthsInRatingPeriod,L82+1,\"\")","v":5},{"$f":"IF(M82<UP_MonthsInRatingPeriod,M82+1,\"\")","v":6},{"$f":"IF(N82<UP_MonthsInRatingPeriod,N82+1,\"\")","v":7},{"$f":"IF(O82<UP_MonthsInRatingPeriod,O82+1,\"\")","v":8},{"$f":"IF(P82<UP_MonthsInRatingPeriod,P82+1,\"\")","v":9},{"$f":"IF(Q82<UP_MonthsInRatingPeriod,Q82+1,\"\")","v":10},{"$f":"IF(R82<UP_MonthsInRatingPeriod,R82+1,\"\")","v":11},{"$f":"IF(S82<UP_MonthsInRatingPeriod,S82+1,\"\")","v":12},{"$f":"IF(T82<UP_MonthsInRatingPeriod,T82+1,\"\")","v":""},{"$f":"IF(U82<UP_MonthsInRatingPeriod,U82+1,\"\")","v":""},{"$f":"IF(V82<UP_MonthsInRatingPeriod,V82+1,\"\")","v":""},{"$f":"IF(W82<UP_MonthsInRatingPeriod,W82+1,\"\")","v":""},{"$f":"IF(X82<UP_MonthsInRatingPeriod,X82+1,\"\")","v":""},{"$f":"IF(Y82<UP_MonthsInRatingPeriod,Y82+1,\"\")","v":""},{"$f":"IF(Z82<UP_MonthsInRatingPeriod,Z82+1,\"\")","v":""},{"$f":"IF(AA82<UP_MonthsInRatingPeriod,AA82+1,\"\")","v":""},{"$f":"IF(AB82<UP_MonthsInRatingPeriod,AB82+1,\"\")","v":""},{"$f":"IF(AC82<UP_MonthsInRatingPeriod,AC82+1,\"\")","v":""},{"$f":"IF(AD82<UP_MonthsInRatingPeriod,AD82+1,\"\")","v":""},{"$f":"IF(AE82<UP_MonthsInRatingPeriod,AE82+1,\"\")","v":""},{"$f":"IF(AF82<UP_MonthsInRatingPeriod,AF82+1,\"\")","v":""},{"$f":"IF(AG82<UP_MonthsInRatingPeriod,AG82+1,\"\")","v":""},{"$f":"IF(AH82<UP_MonthsInRatingPeriod,AH82+1,\"\")","v":""},{"$f":"IF(AI82<UP_MonthsInRatingPeriod,AI82+1,\"\")","v":""},{"$f":"IF(AJ82<UP_MonthsInRatingPeriod,AJ82+1,\"\")","v":""},{"$f":"IF(AK82<UP_MonthsInRatingPeriod,AK82+1,\"\")","v":""},{"$f":"IF(AL82<UP_MonthsInRatingPeriod,AL82+1,\"\")","v":""},{"$f":"IF(AM82<UP_MonthsInRatingPeriod,AM82+1,\"\")","v":""},{"$f":"IF(AN82<UP_MonthsInRatingPeriod,AN82+1,\"\")","v":""},{"$f":"IF(AO82<UP_MonthsInRatingPeriod,AO82+1,\"\")","v":""},{"$f":"IF(AP82<UP_MonthsInRatingPeriod,AP82+1,\"\")","v":""},{"$f":"IF(AQ82<UP_MonthsInRatingPeriod,AQ82+1,\"\")","v":""}]
["Discount %",null,{"$f":"VLOOKUP(C82,'Drop Downs'!A41:B44,2,FALSE)","v":0},null,null,null,null,"Months of Interest Earned",{"$f":"UP_MonthsInRatingPeriod","v":12},{"$f":"IF(ISNUMBER(J82),I83-1,\"\")","v":11},{"$f":"IF(ISNUMBER(K82),J83-1,\"\")","v":10},{"$f":"IF(ISNUMBER(L82),K83-1,\"\")","v":9},{"$f":"IF(ISNUMBER(M82),L83-1,\"\")","v":8},{"$f":"IF(ISNUMBER(N82),M83-1,\"\")","v":7},{"$f":"IF(ISNUMBER(O82),N83-1,\"\")","v":6},{"$f":"IF(ISNUMBER(P82),O83-1,\"\")","v":5},{"$f":"IF(ISNUMBER(Q82),P83-1,\"\")","v":4},{"$f":"IF(ISNUMBER(R82),Q83-1,\"\")","v":3},{"$f":"IF(ISNUMBER(S82),R83-1,\"\")","v":2},{"$f":"IF(ISNUMBER(T82),S83-1,\"\")","v":1},{"$f":"IF(ISNUMBER(U82),T83-1,\"\")","v":""},{"$f":"IF(ISNUMBER(V82),U83-1,\"\")","v":""},{"$f":"IF(ISNUMBER(W82),V83-1,\"\")","v":""},{"$f":"IF(ISNUMBER(X82),W83-1,\"\")","v":""},{"$f":"IF(ISNUMBER(Y82),X83-1,\"\")","v":""},{"$f":"IF(ISNUMBER(Z82),Y83-1,\"\")","v":""},{"$f":"IF(ISNUMBER(AA82),Z83-1,\"\")","v":""},{"$f":"IF(ISNUMBER(AB82),AA83-1,\"\")","v":""},{"$f":"IF(ISNUMBER(AC82),AB83-1,\"\")","v":""},{"$f":"IF(ISNUMBER(AD82),AC83-1,\"\")","v":""},{"$f":"IF(ISNUMBER(AE82),AD83-1,\"\")","v":""},{"$f":"IF(ISNUMBER(AF82),AE83-1,\"\")","v":""},{"$f":"IF(ISNUMBER(AG82),AF83-1,\"\")","v":""},{"$f":"IF(ISNUMBER(AH82),AG83-1,\"\")","v":""},{"$f":"IF(ISNUMBER(AI82),AH83-1,\"\")","v":""},{"$f":"IF(ISNUMBER(AJ82),AI83-1,\"\")","v":""},{"$f":"IF(ISNUMBER(AK82),AJ83-1,\"\")","v":""},{"$f":"IF(ISNUMBER(AL82),AK83-1,\"\")","v":""},{"$f":"IF(ISNUMBER(AM82),AL83-1,\"\")","v":""},{"$f":"IF(ISNUMBER(AN82),AM83-1,\"\")","v":""},{"$f":"IF(ISNUMBER(AO82),AN83-1,\"\")","v":""},{"$f":"IF(ISNUMBER(AP82),AO83-1,\"\")","v":""},{"$f":"IF(ISNUMBER(AQ82),AP83-1,\"\")","v":""},{"$f":"IF(ISNUMBER(AR82),AQ83-1,\"\")","v":""}]
["Discount PMPM",null,{"$f":"-1*(C78*C83)+0*-SUM(I86:AR86)/UP_MonthsInRatingPeriod","v":0},null,{"$f":"_xlfn.FORMULATEXT(C84)","v":"=-1*(C78*C83)+0*-SUM(I86:AR86)/UP_MonthsInRatingPeriod"},null,null,"Interest Rate",{"$f":"$C83","v":0},{"$f":"$C83","v":0},0,0,0,0,0,0,0,0,0,0]
["Cost of Capital after Discount PMPM",null,{"$f":"C79+C84","v":5.4528358646662589},null,{"$f":"_xlfn.FORMULATEXT(C85)","v":"=C79+C84"},null,null,"RBC Funded",{"$f":"RBC_LowerThreshold+RBC_UpperThreshold*RBC_ThresholdDiscount","v":31.845016415746134},{"$f":"IF(ISNUMBER(J82),$I85,\"\")","v":31.845016415746134},{"$f":"IF(ISNUMBER(K82),$I85,\"\")","v":31.845016415746134},{"$f":"IF(ISNUMBER(L82),$I85,\"\")","v":31.845016415746134},{"$f":"IF(ISNUMBER(M82),$I85,\"\")","v":31.845016415746134},31.845016415746134,31.845016415746134,31.845016415746134,31.845016415746134,31.845016415746134,31.845016415746134,31.845016415746134,"","","","","","","","","","","","","","","","","","","","","","","",""]
["Cost of Capital after Discount as %",null,{"$f":"C85/COC_Premium","v":1.1996292413644723E-2},null,{"$f":"_xlfn.FORMULATEXT(C86)","v":"=C85/COC_Premium"},null,null,"Interest Payment",{"$f":"I85*(1+I84)^(I83/12)-I85","v":0},{"$f":"IF(ISNUMBER(J82),J85*(1+J84)^(J83/12)-J85,\"\")","v":0},0,0,0,0,0,0,0,0,0,0,"","","","","","","","","","","","","","","","","","","","","","","",""]
["Step 5. Calculate Costs Associated with Cash Flow"]
["Step 5.a. Cost Associated with Withholds"]
["Revised Adjusted PMPM",null,{"$f":"(COC_Premium+C85)","v":459.99626283749831},null,{"$f":"_xlfn.FORMULATEXT(C89)","v":"=(COC_Premium+C85)"}]
["Months in Rating Period",null,{"$f":"UP_MonthsInRatingPeriod","v":12}]
["Months following Rating Period before Payment",null,{"$f":"UP_COC_WithholdLag","v":6},null,null,"user input - expected delay in resolving withhold with State (in months following rating period)"]
["Withhold %",null,{"$f":"UP_WithholdPercent","v":0},null,null,"user input - Withhold %"]
["Assumed Withhold Achieved",null,{"$f":"UP_WithholdEarned","v":1},null,null,"user input - % Withhold Achieved",null,"Calculation of Interest accrued on Withhold"]
["Withhold PMPM",null,{"$f":"(C92*C93)*C89","v":0},null,{"$f":"_xlfn.FORMULATEXT(C94)","v":"=(C92*C93)*C89"},null,null,"Month No.",1,{"$f":"IF(I94<UP_MonthsInRatingPeriod,I94+1,\"\")","v":2},3,4,5,6,7,8,9,10,11,12,"","","","","","","","","","","","","","","","","","","","","","","",""]
["Factor to Apply to Cost of Withhold",null,{"$f":"UP_COC_Selection_RevenueLagRate","v":"None"},null,null,"user input",null,"Months of Interest Owed",{"$f":"UP_MonthsInRatingPeriod+$C$91","v":18},{"$f":"IF(ISNUMBER(J94),I95-1,\"\")","v":17},{"$f":"IF(ISNUMBER(K94),J95-1,\"\")","v":16},15,14,13,12,11,10,9,8,7,"","","","","","","","","","","","","","","","","","","","","","","",""]
[{"$f":"C95","v":"None"},null,{"$f":"UP_COC_RevenueLagRate","v":0},null,null,"user input",null,"Interest Rate",{"$f":"$C$96","v":0},{"$f":"IF(ISNUMBER(J94),$C$96,\"\")","v":0},{"$f":"IF(ISNUMBER(K94),$C$96,\"\")","v":0},0,0,0,0,0,0,0,0,0,"","","","","","","","","","","","","","","","","","","","","","","",""]
["Cumulative Interest Accrued to MCO",null,{"$f":"-FV((1+C96)^(1/12)-1,C90+C91,C94,,0)-(C94*(C90+C91))","v":0},null,{"$f":"_xlfn.FORMULATEXT(C97)","v":"=-FV((1+C96)^(1/12)-1,C90+C91,C94,,0)-(C94*(C90+C91))"}," Interest owed to MCO for withholds held, including compounding of interest",null,"Withhold PMPM",{"$f":"$C$94","v":0},{"$f":"IF(ISNUMBER(J94),$C$94,\"\")","v":0},{"$f":"IF(ISNUMBER(K94),$C$94,\"\")","v":0},0,0,0,0,0,0,0,0,0,"","","","","","","","","","","","","","","","","","","","","","","",""]
["Monthly Interest Owed on Withhold PMPM",null,{"$f":"C97/12","v":0},null,{"$f":"_xlfn.FORMULATEXT(C98)","v":"=C97/12"},null,null,"Interest Payment",{"$f":"I97*(1+I96)^(I95/12)-I97","v":0},{"$f":"IF(ISNUMBER(J94),J97*(1+J96)^(J95/12)-J97,\"\")","v":0},{"$f":"IF(ISNUMBER(K94),K97*(1+K96)^(K95/12)-K97,\"\")","v":0},{"$f":"IF(ISNUMBER(L94),L97*(1+L96)^(L95/12)-L97,\"\")","v":0},{"$f":"IF(ISNUMBER(M94),M97*(1+M96)^(M95/12)-M97,\"\")","v":0},{"$f":"IF(ISNUMBER(N94),N97*(1+N96)^(N95/12)-N97,\"\")","v":0},{"$f":"IF(ISNUMBER(O94),O97*(1+O96)^(O95/12)-O97,\"\")","v":0},{"$f":"IF(ISNUMBER(P94),P97*(1+P96)^(P95/12)-P97,\"\")","v":0},{"$f":"IF(ISNUMBER(Q94),Q97*(1+Q96)^(Q95/12)-Q97,\"\")","v":0},{"$f":"IF(ISNUMBER(R94),R97*(1+R96)^(R95/12)-R97,\"\")","v":0},{"$f":"IF(ISNUMBER(S94),S97*(1+S96)^(S95/12)-S97,\"\")","v":0},{"$f":"IF(ISNUMBER(T94),T97*(1+T96)^(T95/12)-T97,\"\")","v":0},{"$f":"IF(ISNUMBER(U94),U97*(1+U96)^(U95/12)-U97,\"\")","v":""},{"$f":"IF(ISNUMBER(V94),V97*(1+V96)^(V95/12)-V97,\"\")","v":""},{"$f":"IF(ISNUMBER(W94),W97*(1+W96)^(W95/12)-W97,\"\")","v":""},{"$f":"IF(ISNUMBER(X94),X97*(1+X96)^(X95/12)-X97,\"\")","v":""},{"$f":"IF(ISNUMBER(Y94),Y97*(1+Y96)^(Y95/12)-Y97,\"\")","v":""},{"$f":"IF(ISNUMBER(Z94),Z97*(1+Z96)^(Z95/12)-Z97,\"\")","v":""},{"$f":"IF(ISNUMBER(AA94),AA97*(1+AA96)^(AA95/12)-AA97,\"\")","v":""},{"$f":"IF(ISNUMBER(AB94),AB97*(1+AB96)^(AB95/12)-AB97,\"\")","v":""},{"$f":"IF(ISNUMBER(AC94),AC97*(1+AC96)^(AC95/12)-AC97,\"\")","v":""},{"$f":"IF(ISNUMBER(AD94),AD97*(1+AD96)^(AD95/12)-AD97,\"\")","v":""},{"$f":"IF(ISNUMBER(AE94),AE97*(1+AE96)^(AE95/12)-AE97,\"\")","v":""},{"$f":"IF(ISNUMBER(AF94),AF97*(1+AF96)^(AF95/12)-AF97,\"\")","v":""},{"$f":"IF(ISNUMBER(AG94),AG97*(1+AG96)^(AG95/12)-AG97,\"\")","v":""},{"$f":"IF(ISNUMBER(AH94),AH97*(1+AH96)^(AH95/12)-AH97,\"\")","v":""},{"$f":"IF(ISNUMBER(AI94),AI97*(1+AI96)^(AI95/12)-AI97,\"\")","v":""},{"$f":"IF(ISNUMBER(AJ94),AJ97*(1+AJ96)^(AJ95/12)-AJ97,\"\")","v":""},{"$f":"IF(ISNUMBER(AK94),AK97*(1+AK96)^(AK95/12)-AK97,\"\")","v":""},{"$f":"IF(ISNUMBER(AL94),AL97*(1+AL96)^(AL95/12)-AL97,\"\")","v":""},{"$f":"IF(ISNUMBER(AM94),AM97*(1+AM96)^(AM95/12)-AM97,\"\")","v":""},{"$f":"IF(ISNUMBER(AN94),AN97*(1+AN96)^(AN95/12)-AN97,\"\")","v":""},{"$f":"IF(ISNUMBER(AO94),AO97*(1+AO96)^(AO95/12)-AO97,\"\")","v":""},{"$f":"IF(ISNUMBER(AP94),AP97*(1+AP96)^(AP95/12)-AP97,\"\")","v":""},{"$f":"IF(ISNUMBER(AQ94),AQ97*(1+AQ96)^(AQ95/12)-AQ97,\"\")","v":""},{"$f":"IF(ISNUMBER(AR94),AR97*(1+AR96)^(AR95/12)-AR97,\"\")","v":""}]
["Cost of Interest on Withhold as % of Premium",null,{"$f":"C98/COC_Premium","v":0},null,"=C98/COC_Premium"]
["Step 5.b. Cost Associated with a Delay in Premiums",null,null,null,null,null,null,null,null,null,null,null,null,null,null,null,null,null,null,{"$f":"SUM(I98:T98)","v":0}]
["Revised Adjusted PMPM with Cost of Capital",null,{"$f":"C89+C98","v":459.99626283749831},null,{"$f":"_xlfn.FORMULATEXT(C101)","v":"=C89+C98"}]
["Months of Average Delay",null,{"$f":"UP_COC_PremiumLag","v":2},null,null,"user input - expected delay in receipt of premiums from State (in Months)"]
[{"$f":"C95","v":"None"},null,{"$f":"C96","v":0},null,{"$f":"_xlfn.FORMULATEXT(C103)","v":"=C96"}]
["Accumulative Interest Owed on Premium Delay PMPM",null,{"$f":"(C101*C102)*(1+C103)^(C102/12)-(C102*C101)","v":0},null,{"$f":"_xlfn.FORMULATEXT(C104)","v":"=(C101*C102)*(1+C103)^(C102/12)-(C102*C101)"}]
["Cost of Payment Delay as %",null,{"$f":"C104/COC_Premium","v":0},null,{"$f":"_xlfn.FORMULATEXT(C105)","v":"=C104/COC_Premium"}]
["Step 5.c. Offsets Associated with a Delay in Provider Payments"]
["Medical Premium",null,{"$f":"C4","v":400}]
["Average Lag in Months",null,{"$f":"UP_COC_ClaimLag","v":0}]
["% of Claims Subject to Lag",null,{"$f":"UP_COC_ClaimLagPercent","v":0}]
["Risk Free Rate of Return (Rf)",null,{"$f":"Rf","v":2.278852459016394E-2},null,{"$f":"_xlfn.FORMULATEXT(C110)","v":"=Rf"}]
["Interest Earned on Claims' Payment Delay",null,{"$f":"-((C107*C109)*(1+C110)^(C108/12)-(C107*C109))","v":0},null,{"$f":"_xlfn.FORMULATEXT(C111)","v":"=-((C107*C109)*(1+C110)^(C108/12)-(C107*C109))"}]
["Earnings from Reimbursement Delay as %",null,{"$f":"C111/COC_Premium","v":0}]
["Step 6. Total Cost of Capital"]
["Net Cost of Capital PMPM",null,{"$f":"C85+C98+C104+C111","v":5.4528358646662589},null,{"$f":"_xlfn.FORMULATEXT(C114)","v":"=C85+C98+C104+C111"}]
["Net Cost of Capital as %",null,{"$f":"C114/COC_Premium","v":1.1996292413644723E-2},null,{"$f":"_xlfn.FORMULATEXT(C115)","v":"=C114/COC_Premium"}]

{"sheet":"Net Income Matrix","index":6,"n_rows":168,"n_cols":39,"rows_kept":168,"cut":false,"hidden":false,"merged":[[5,30,5,34],[5,1,5,3],[5,4,5,7],[5,27,5,29],[5,23,5,26],[5,19,5,22],[5,10,5,16]]}
["Net Income Matrix",null,null,null,null,null,null,null,null,null,"Risk Corridors:","I","II","III","IV","V","VI",null,null,null,null,null,null,null,null,null,null,null,{"$f":"'User Parameters'!B8","v":"MCO Size Curve"}]
[null,null,null,null,null,null,null,null,null,null,"Lower Threshold",{"$f":"IF(UP_RSBasis=\"No Risk Share\",0,'User Parameters'!F13)","v":0},{"$f":"L3","v":0},{"$f":"M3","v":0},{"$f":"N3","v":0},{"$f":"O3","v":0},{"$f":"P3","v":0},null,null,null,null,null,null,null,null,null,null,"Mean of Underwriting Margin",null,{"$f":"H88","v":3.1995682062082254E-2}]
[null,null,null,null,null,null,null,null,null,null,"Upper Threshold",{"$f":"IF(UP_RSBasis=\"No Risk Share\",0,'User Parameters'!H13)","v":0},{"$f":"IF(UP_RSBasis=\"No Risk Share\",0,'User Parameters'!H14)","v":0},{"$f":"IF(UP_RSBasis=\"No Risk Share\",0,'User Parameters'!H15)","v":0},{"$f":"IF(UP_RSBasis=\"No Risk Share\",0,'User Parameters'!H16)","v":0},{"$f":"IF(UP_RSBasis=\"No Risk Share\",0,'User Parameters'!H17)","v":0},{"$f":"IF(UP_RSBasis=\"No Risk Share\",0,'User Parameters'!H18)","v":0},null,null,null,null,null,null,null,null,null,null,"Standard Deviation",null,{"$f":"'User Parameters'!C8","v":3.29408739094647E-2}]
[null,null,null,null,null,null,null,null,null,null,"State Share",{"$f":"IF(UP_RSBasis=\"No Risk Share\",0,1-'User Parameters'!I13)","v":0},{"$f":"IF(UP_RSBasis=\"No Risk Share\",0,1-'User Parameters'!I14)","v":0},{"$f":"IF(UP_RSBasis=\"No Risk Share\",0,1-'User Parameters'!I15)","v":0},{"$f":"IF(UP_RSBasis=\"No Risk Share\",0,1-'User Parameters'!I16)","v":0},{"$f":"IF(UP_RSBasis=\"No Risk Share\",0,1-'User Parameters'!I17)","v":0},{"$f":"IF(UP_RSBasis=\"No Risk Share\",0,1-'User Parameters'!I18)","v":0},null,null,null,null,null,null,null,null,null,null,null,null,null,null,null,null,null,null,null,"excluding lag in CoC infusions"]
["Ave/Total",{"$f":"SUMPRODUCT(B$8:B$168,$AD$8:$AD$168)","v":454.54342697283192},400.00000000000011,0.88000392539810757,40.000000000000007,0,14.543426972831984,3.1995682062082142E-2,0.88000392539810757,0,0,{"$f":"SUMPRODUCT(L$8:L$168,$AD$8:$AD$168)","v":0},0,0,0,0,0,{"$f":"SUMPRODUCT(R$8:R$168,$AD$8:$AD$168)","v":0},0,0.88000392539810757,0.88000392539810757,0,0,3.1995682062082142E-2,0,0,{"$f":"SUMPRODUCT(AA$8:AA$168,$AD$8:$AD$168)","v":3.1995682062082142E-2},null,{"$f":"SUM(AC$8:AC$168)","v":0.99999999999999944},{"$f":"SUM(AD$8:AD$168)","v":1},{"$f":"SUMPRODUCT(AE$8:AE$168,$AD$8:$AD$168)","v":-3.1549958286551568E-4},{"$f":"SUMPRODUCT(AF$8:AF$168,$AD$8:$AD$168)","v":-1.1873830346632941E-5},{"$f":"SUMPRODUCT(AG$8:AG$168,$AD$8:$AD$168)","v":-1.1873830346632941E-5},{"$f":"SUMPRODUCT(AH$8:AH$168,$AD$8:$AD$168)","v":-3.6852144512593884E-11},{"$f":"SUMPRODUCT(AI$8:AI$168,$AD$8:$AD$168)","v":-3.6852144512593884E-11},null,{"$f":"SUMPRODUCT(AK$8:AK$168,$AD$8:$AD$168)","v":0},0,{"$f":"SUMPRODUCT(AM$8:AM$168,$AD$8:$AD$168)","v":3.1995682062082142E-2}]
["Bin","Claims Calculation",null,null,"Underwriting Margin Calculation",null,null,null,"MLR","Risk Share Target","Risk Corridor Calculations",null,null,null,null,null,null,null,null,"MLR Limit Calculation",null,null,null,"Net Income Calculation",null,null,null,"Normal Curve",null,null,"Probability of Ruin Results"]
["Loss Ratio","Prem PMPM","Claims PMPM","Initial MLR","Admin","Premium Tax","Underwriting Margin","Underwriting Margin Ratio","Alternative:\nFor purposes or Risk Share use MLR (as used for MLR Limit) not Loss Ratio",{"$f":"IF(UP_RSBasis=\"MLR\",\"Risk Share Target %\",IF(UP_RSBasis=\"Medical Baseline\",\"Claims PMPM\",\"N/A\"))","v":"N/A"},{"$f":"IF(UP_RSBasis=\"MLR\",\"MLR Gain/(Loss)\",IF(UP_RSBasis=\"Medical Baseline\",\"Medical Gain/(Loss)\",\"\"))","v":""},"Corridor I","Corridor II","Corridor III","Corridor IV","Corridor V","Corridor VI",{"$f":"IF(UP_RSBasis=\"MLR\",\"MLR Adjustment\",\"\")","v":""},"Claims Adjustment","Adjusted MLR","Capped MLR","Net Transfer Payment ","Net Transfer Payment as a % of Prem","Gain/Loss as a % of Prem","Cost of Capital Infusion on Gains/Losses Before Transfer Payments (as a % of Prem)","Withhold Unachieved as a % of Prem","Net Income as a % of Prem","Density Function","Probability","Adjusted Probability","Authorized Control Level (ACL)","200% of ACL","Minimum Threshold",{"$f":"\"Target  (Discount = \"&UP_COC_RBCThresholdDiscount*100&\"%)\"","v":"Target  (Discount = 0%)"},"Maximum Threshold"]
[{"$f":"A9-0.005","v":0.48000392539810666},{"$f":"$B$88","v":454.54342697283204},{"$f":"B8*A8","v":218.18262921086702},{"$f":"(C8)/(B8)","v":0.48000392539810666},{"$f":"'User Parameters'!$C$10","v":40},{"$f":"B8*'User Parameters'!$C$14","v":0},{"$f":"B8-E8-C8-F8","v":196.36079776196502},{"$f":"G8/B8","v":0.43199568206208261},{"$f":"($C8+UP_QIPMPM)/($B8-$F8)","v":0.48000392539810666},{"$f":"IF(UP_RSBasis=\"MLR\",UP_RSTarget_MLR,IF(UP_RSBasis=\"Medical Baseline\",UP_RSTarget_Medlcal,0))","v":0},{"$f":"IF(UP_RSBasis=\"MLR\",J8-I8,IF(UP_RSBasis=\"Medical Baseline\",J8-$C8,0))","v":0},{"$f":"IF($K8>0,MIN(J8*L$3-J8*L$2,$K8-M8-N8),0)","v":0},{"$f":"IF($K8>0,MIN(J8*M$3-J8*M$2,$K8-N8),0)","v":0},{"$f":"IF($K8>0,MIN(J8*N$3-J8*N$2,$K8),0)","v":0},{"$f":"IF($K8<0,MAX(J8*O$2-J8*O$3,$K8),0)","v":0},{"$f":"IF($K8<0,MAX(J8*P$2-J8*P$3,$K8-O8),0)","v":0},{"$f":"IF($K8<0,MAX(J8*Q$2-J8*Q$3,$K8-P8-O8),0)","v":0},{"$f":"IF(UP_RSBasis=\"MLR\",SUMPRODUCT(L$4:Q$4,L8:Q8),\"\")","v":""},{"$f":"IF(UP_RSBasis=\"MLR\",R8*(B8-F8),SUMPRODUCT($L$4:$Q$4,$L8:$Q8))","v":0},{"$f":"(S8+C8+'User Parameters'!$C$11)/(B8-F8)","v":0.48000392539810666},{"$f":"IF(T8<'User Parameters'!$J$5,'User Parameters'!$J$5,IF(T8>'User Parameters'!$J$6,'User Parameters'!$J$6,T8))","v":0.48000392539810666},{"$f":"(U8-T8)*(B8-F8)","v":0},{"$f":"V8/B8","v":0},{"$f":"(B8-C8-F8-E8-S8-V8)/'Results Dashboard'!$D$42","v":0.43199568206208261},{"$f":"IF((X8+W8)>0,(X8+W8)*0.5*((1+'User Parameters'!C$48)^((12+UP_COC_WithholdLag)/12)-1),(X8+W8)*0.5*((1+'User Parameters'!$C$49)^((12+UP_COC_WithholdLag)/12)-1))","v":0},{"$f":"-'User Parameters'!$C$12*('User Parameters'!$C$13-1)","v":0},{"$f":"Y8+X8-Z8","v":0.43199568206208261},{"$f":"_xlfn.NORM.DIST(H8,$AD$2,$AD$3,TRUE)","v":1},{"$f":"AB8-AB9","v":0},{"$f":"AC8+(1-AC5)/2","v":2.7755575615628914E-16},{"$f":"IF($AA8<-'Results Dashboard'!$J$7,$AA8+'Results Dashboard'!$J$7,0)","v":0},{"$f":"IF($AA8<-'Results Dashboard'!$J$8,$AA8+'Results Dashboard'!$J$8,0)","v":0},{"$f":"IF($AA8<-'Results Dashboard'!$J$9,$AA8+'Results Dashboard'!$J$9,0)","v":0},{"$f":"IF($AA8<-'Results Dashboard'!$J$11,$AA8+'Results Dashboard'!$J$11,0)","v":0},{"$f":"IF($AA8<-'Results Dashboard'!$J$10,$AA8+'Results Dashboard'!$J$10,0)","v":0},null,{"$f":"IF((X8+W8)>0,(X8+W8)*0.5*'User Parameters'!C$48,(X8+W8)*0.5*'User Parameters'!$C$49)","v":0},{"$f":"-'User Parameters'!$C$12*('User Parameters'!$C$13-1)","v":0},{"$f":"-AK8+X8-AL8","v":0.43199568206208261}]
[0.48500392539810666,454.54342697283204,{"$f":"B9*A9","v":220.45534634573119},{"$f":"(C9)/(B9)","v":0.48500392539810672},{"$f":"'User Parameters'!$C$10","v":40},{"$f":"B9*'User Parameters'!$C$14","v":0},{"$f":"B9-E9-C9-F9","v":194.08808062710085},{"$f":"G9/B9","v":0.4269956820620826},{"$f":"($C9+UP_QIPMPM)/($B9-$F9)","v":0.48500392539810672},{"$f":"IF(UP_RSBasis=\"MLR\",UP_RSTarget_MLR,IF(UP_RSBasis=\"Medical Baseline\",UP_RSTarget_Medlcal,0))","v":0},0,{"$f":"IF($K9>0,MIN(J9*L$3-J9*L$2,$K9-M9-N9),0)","v":0},{"$f":"IF($K9>0,MIN(J9*M$3-J9*M$2,$K9-N9),0)","v":0},{"$f":"IF($K9>0,MIN(J9*N$3-J9*N$2,$K9),0)","v":0},{"$f":"IF($K9<0,MAX(J9*O$2-J9*O$3,$K9),0)","v":0},{"$f":"IF($K9<0,MAX(J9*P$2-J9*P$3,$K9-O9),0)","v":0},{"$f":"IF($K9<0,MAX(J9*Q$2-J9*Q$3,$K9-P9-O9),0)","v":0},"",0,{"$f":"(S9+C9+'User Parameters'!$C$11)/(B9-F9)","v":0.48500392539810672},{"$f":"IF(T9<'User Parameters'!$J$5,'User Parameters'!$J$5,IF(T9>'User Parameters'!$J$6,'User Parameters'!$J$6,T9))","v":0.48500392539810672},0,0,{"$f":"(B9-C9-F9-E9-S9-V9)/'Results Dashboard'!$D$42","v":0.4269956820620826},{"$f":"IF((X9+W9)>0,(X9+W9)*0.5*((1+'User Parameters'!C$48)^((12+UP_COC_WithholdLag)/12)-1),(X9+W9)*0.5*((1+'User Parameters'!$C$49)^((12+UP_COC_WithholdLag)/12)-1))","v":0},{"$f":"-'User Parameters'!$C$12*('User Parameters'!$C$13-1)","v":0},{"$f":"Y9+X9-Z9","v":0.4269956820620826},1,{"$f":"AB9-AB10","v":0},{"$f":"AC9","v":0},{"$f":"IF($AA9<-'Results Dashboard'!$J$7,$AA9+'Results Dashboard'!$J$7,0)","v":0},{"$f":"IF($AA9<-'Results Dashboard'!$J$8,$AA9+'Results Dashboard'!$J$8,0)","v":0},{"$f":"IF($AA9<-'Results Dashboard'!$J$9,$AA9+'Results Dashboard'!$J$9,0)","v":0},{"$f":"IF($AA9<-'Results Dashboard'!$J$11,$AA9+'Results Dashboard'!$J$11,0)","v":0},{"$f":"IF($AA9<-'Results Dashboard'!$J$10,$AA9+'Results Dashboard'!$J$10,0)","v":0},null,{"$f":"IF((X9+W9)>0,(X9+W9)*0.5*'User Parameters'!C$48,(X9+W9)*0.5*'User Parameters'!$C$49)","v":0},{"$f":"-'User Parameters'!$C$12*('User Parameters'!$C$13-1)","v":0},{"$f":"-AK9+X9-AL9","v":0.4269956820620826}]
[0.49000392539810667,454.54342697283204,222.72806348059532,0.49000392539810667,{"$f":"'User Parameters'!$C$10","v":40},{"$f":"B10*'User Parameters'!$C$14","v":0},191.81536349223671,0.42199568206208266,0.49000392539810667,{"$f":"IF(UP_RSBasis=\"MLR\",UP_RSTarget_MLR,IF(UP_RSBasis=\"Medical Baseline\",UP_RSTarget_Medlcal,0))","v":0},0,0,0,0,0,0,0,"",0,{"$f":"(S10+C10+'User Parameters'!$C$11)/(B10-F10)","v":0.49000392539810667},{"$f":"IF(T10<'User Parameters'!$J$5,'User Parameters'!$J$5,IF(T10>'User Parameters'!$J$6,'User Parameters'!$J$6,T10))","v":0.49000392539810667},0,0,{"$f":"(B10-C10-F10-E10-S10-V10)/'Results Dashboard'!$D$42","v":0.42199568206208266},{"$f":"IF((X10+W10)>0,(X10+W10)*0.5*((1+'User Parameters'!C$48)^((12+UP_COC_WithholdLag)/12)-1),(X10+W10)*0.5*((1+'User Parameters'!$C$49)^((12+UP_COC_WithholdLag)/12)-1))","v":0},{"$f":"-'User Parameters'!$C$12*('User Parameters'!$C$13-1)","v":0},0.42199568206208266,1,0,{"$f":"AC10","v":0},{"$f":"IF($AA10<-'Results Dashboard'!$J$7,$AA10+'Results Dashboard'!$J$7,0)","v":0},{"$f":"IF($AA10<-'Results Dashboard'!$J$8,$AA10+'Results Dashboard'!$J$8,0)","v":0},{"$f":"IF($AA10<-'Results Dashboard'!$J$9,$AA10+'Results Dashboard'!$J$9,0)","v":0},{"$f":"IF($AA10<-'Results Dashboard'!$J$11,$AA10+'Results Dashboard'!$J$11,0)","v":0},{"$f":"IF($AA10<-'Results Dashboard'!$J$10,$AA10+'Results Dashboard'!$J$10,0)","v":0},null,{"$f":"IF((X10+W10)>0,(X10+W10)*0.5*'User Parameters'!C$48,(X10+W10)*0.5*'User Parameters'!$C$49)","v":0},{"$f":"-'User Parameters'!$C$12*('User Parameters'!$C$13-1)","v":0},0.42199568206208266]
[0.49500392539810667,454.54342697283204,225.00078061545949,0.49500392539810667,{"$f":"'User Parameters'!$C$10","v":40},{"$f":"B11*'User Parameters'!$C$14","v":0},189.54264635737255,0.41699568206208265,0.49500392539810667,{"$f":"IF(UP_RSBasis=\"MLR\",UP_RSTarget_MLR,IF(UP_RSBasis=\"Medical Baseline\",UP_RSTarget_Medlcal,0))","v":0},0,0,0,0,0,0,0,"",0,{"$f":"(S11+C11+'User Parameters'!$C$11)/(B11-F11)","v":0.49500392539810667},{"$f":"IF(T11<'User Parameters'!$J$5,'User Parameters'!$J$5,IF(T11>'User Parameters'!$J$6,'User Parameters'!$J$6,T11))","v":0.49500392539810667},0,0,{"$f":"(B11-C11-F11-E11-S11-V11)/'Results Dashboard'!$D$42","v":0.41699568206208265},{"$f":"IF((X11+W11)>0,(X11+W11)*0.5*((1+'User Parameters'!C$48)^((12+UP_COC_WithholdLag)/12)-1),(X11+W11)*0.5*((1+'User Parameters'!$C$49)^((12+UP_COC_WithholdLag)/12)-1))","v":0},{"$f":"-'User Parameters'!$C$12*('User Parameters'!$C$13-1)","v":0},0.41699568206208265,1,0,0,{"$f":"IF($AA11<-'Results Dashboard'!$J$7,$AA11+'Results Dashboard'!$J$7,0)","v":0},{"$f":"IF($AA11<-'Results Dashboard'!$J$8,$AA11+'Results Dashboard'!$J$8,0)","v":0},{"$f":"IF($AA11<-'Results Dashboard'!$J$9,$AA11+'Results Dashboard'!$J$9,0)","v":0},{"$f":"IF($AA11<-'Results Dashboard'!$J$11,$AA11+'Results Dashboard'!$J$11,0)","v":0},{"$f":"IF($AA11<-'Results Dashboard'!$J$10,$AA11+'Results Dashboard'!$J$10,0)","v":0},null,{"$f":"IF((X11+W11)>0,(X11+W11)*0.5*'User Parameters'!C$48,(X11+W11)*0.5*'User Parameters'!$C$49)","v":0},{"$f":"-'User Parameters'!$C$12*('User Parameters'!$C$13-1)","v":0},0.41699568206208265]
[0.50000392539810667,454.54342697283204,227.27349775032366,0.50000392539810667,{"$f":"'User Parameters'!$C$10","v":40},{"$f":"B12*'User Parameters'!$C$14","v":0},187.26992922250838,0.41199568206208265,0.50000392539810667,{"$f":"IF(UP_RSBasis=\"MLR\",UP_RSTarget_MLR,IF(UP_RSBasis=\"Medical Baseline\",UP_RSTarget_Medlcal,0))","v":0},0,0,0,0,0,{"$f":"IF($K12<0,MAX(J12*P$2-J12*P$3,$K12-O12),0)","v":0},0,"",0,{"$f":"(S12+C12+'User Parameters'!$C$11)/(B12-F12)","v":0.50000392539810667},{"$f":"IF(T12<'User Parameters'!$J$5,'User Parameters'!$J$5,IF(T12>'User Parameters'!$J$6,'User Parameters'!$J$6,T12))","v":0.50000392539810667},0,0,{"$f":"(B12-C12-F12-E12-S12-V12)/'Results Dashboard'!$D$42","v":0.41199568206208265},{"$f":"IF((X12+W12)>0,(X12+W12)*0.5*((1+'User Parameters'!C$48)^((12+UP_COC_WithholdLag)/12)-1),(X12+W12)*0.5*((1+'User Parameters'!$C$49)^((12+UP_COC_WithholdLag)/12)-1))","v":0},{"$f":"-'User Parameters'!$C$12*('User Parameters'!$C$13-1)","v":0},0.41199568206208265,1,0,0,{"$f":"IF($AA12<-'Results Dashboard'!$J$7,$AA12+'Results Dashboard'!$J$7,0)","v":0},{"$f":"IF($AA12<-'Results Dashboard'!$J$8,$AA12+'Results Dashboard'!$J$8,0)","v":0},{"$f":"IF($AA12<-'Results Dashboard'!$J$9,$AA12+'Results Dashboard'!$J$9,0)","v":0},{"$f":"IF($AA12<-'Results Dashboard'!$J$11,$AA12+'Results Dashboard'!$J$11,0)","v":0},{"$f":"IF($AA12<-'Results Dashboard'!$J$10,$AA12+'Results Dashboard'!$J$10,0)","v":0},null,{"$f":"IF((X12+W12)>0,(X12+W12)*0.5*'User Parameters'!C$48,(X12+W12)*0.5*'User Parameters'!$C$49)","v":0},{"$f":"-'User Parameters'!$C$12*('User Parameters'!$C$13-1)","v":0},0.41199568206208265]
[0.50500392539810668,454.54342697283204,229.54621488518782,0.50500392539810668,{"$f":"'User Parameters'!$C$10","v":40},{"$f":"B13*'User Parameters'!$C$14","v":0},184.99721208764421,0.40699568206208259,0.50500392539810668,{"$f":"IF(UP_RSBasis=\"MLR\",UP_RSTarget_MLR,IF(UP_RSBasis=\"Medical Baseline\",UP_RSTarget_Medlcal,0))","v":0},0,0,0,0,0,0,0,"",0,{"$f":"(S13+C13+'User Parameters'!$C$11)/(B13-F13)","v":0.50500392539810668},{"$f":"IF(T13<'User Parameters'!$J$5,'User Parameters'!$J$5,IF(T13>'User Parameters'!$J$6,'User Parameters'!$J$6,T13))","v":0.50500392539810668},0,0,{"$f":"(B13-C13-F13-E13-S13-V13)/'Results Dashboard'!$D$42","v":0.40699568206208259},{"$f":"IF((X13+W13)>0,(X13+W13)*0.5*((1+'User Parameters'!C$48)^((12+UP_COC_WithholdLag)/12)-1),(X13+W13)*0.5*((1+'User Parameters'!$C$49)^((12+UP_COC_WithholdLag)/12)-1))","v":0},{"$f":"-'User Parameters'!$C$12*('User Parameters'!$C$13-1)","v":0},0.40699568206208259,1,0,0,{"$f":"IF($AA13<-'Results Dashboard'!$J$7,$AA13+'Results Dashboard'!$J$7,0)","v":0},{"$f":"IF($AA13<-'Results Dashboard'!$J$8,$AA13+'Results Dashboard'!$J$8,0)","v":0},{"$f":"IF($AA13<-'Results Dashboard'!$J$9,$AA13+'Results Dashboard'!$J$9,0)","v":0},{"$f":"IF($AA13<-'Results Dashboard'!$J$11,$AA13+'Results Dashboard'!$J$11,0)","v":0},{"$f":"IF($AA13<-'Results Dashboard'!$J$10,$AA13+'Results Dashboard'!$J$10,0)","v":0},null,{"$f":"IF((X13+W13)>0,(X13+W13)*0.5*'User Parameters'!C$48,(X13+W13)*0.5*'User Parameters'!$C$49)","v":0},{"$f":"-'User Parameters'!$C$12*('User Parameters'!$C$13-1)","v":0},0.40699568206208259]
[0.51000392539810668,454.54342697283204,231.81893202005199,0.51000392539810668,{"$f":"'User Parameters'!$C$10","v":40},{"$f":"B14*'User Parameters'!$C$14","v":0},182.72449495278005,0.40199568206208258,0.51000392539810668,{"$f":"IF(UP_RSBasis=\"MLR\",UP_RSTarget_MLR,IF(UP_RSBasis=\"Medical Baseline\",UP_RSTarget_Medlcal,0))","v":0},0,0,0,0,0,0,0,"",0,{"$f":"(S14+C14+'User Parameters'!$C$11)/(B14-F14)","v":0.51000392539810668},{"$f":"IF(T14<'User Parameters'!$J$5,'User Parameters'!$J$5,IF(T14>'User Parameters'!$J$6,'User Parameters'!$J$6,T14))","v":0.51000392539810668},0,0,{"$f":"(B14-C14-F14-E14-S14-V14)/'Results Dashboard'!$D$42","v":0.40199568206208258},{"$f":"IF((X14+W14)>0,(X14+W14)*0.5*((1+'User Parameters'!C$48)^((12+UP_COC_WithholdLag)/12)-1),(X14+W14)*0.5*((1+'User Parameters'!$C$49)^((12+UP_COC_WithholdLag)/12)-1))","v":0},{"$f":"-'User Parameters'!$C$12*('User Parameters'!$C$13-1)","v":0},0.40199568206208258,1,0,0,{"$f":"IF($AA14<-'Results Dashboard'!$J$7,$AA14+'Results Dashboard'!$J$7,0)","v":0},{"$f":"IF($AA14<-'Results Dashboard'!$J$8,$AA14+'Results Dashboard'!$J$8,0)","v":0},{"$f":"IF($AA14<-'Results Dashboard'!$J$9,$AA14+'Results Dashboard'!$J$9,0)","v":0},{"$f":"IF($AA14<-'Results Dashboard'!$J$11,$AA14+'Results Dashboard'!$J$11,0)","v":0},{"$f":"IF($AA14<-'Results Dashboard'!$J$10,$AA14+'Results Dashboard'!$J$10,0)","v":0},null,{"$f":"IF((X14+W14)>0,(X14+W14)*0.5*'User Parameters'!C$48,(X14+W14)*0.5*'User Parameters'!$C$49)","v":0},{"$f":"-'User Parameters'!$C$12*('User Parameters'!$C$13-1)","v":0},0.40199568206208258]
[0.51500392539810669,454.54342697283204,234.09164915491615,0.51500392539810669,{"$f":"'User Parameters'!$C$10","v":40},{"$f":"B15*'User Parameters'!$C$14","v":0},180.45177781791588,0.39699568206208258,0.51500392539810669,{"$f":"IF(UP_RSBasis=\"MLR\",UP_RSTarget_MLR,IF(UP_RSBasis=\"Medical Baseline\",UP_RSTarget_Medlcal,0))","v":0},0,0,0,0,0,0,0,"",0,{"$f":"(S15+C15+'User Parameters'!$C$11)/(B15-F15)","v":0.51500392539810669},{"$f":"IF(T15<'User Parameters'!$J$5,'User Parameters'!$J$5,IF(T15>'User Parameters'!$J$6,'User Parameters'!$J$6,T15))","v":0.51500392539810669},0,0,{"$f":"(B15-C15-F15-E15-S15-V15)/'Results Dashboard'!$D$42","v":0.39699568206208258},{"$f":"IF((X15+W15)>0,(X15+W15)*0.5*((1+'User Parameters'!C$48)^((12+UP_COC_WithholdLag)/12)-1),(X15+W15)*0.5*((1+'User Parameters'!$C$49)^((12+UP_COC_WithholdLag)/12)-1))","v":0},{"$f":"-'User Parameters'!$C$12*('User Parameters'!$C$13-1)","v":0},0.39699568206208258,1,0,0,{"$f":"IF($AA15<-'Results Dashboard'!$J$7,$AA15+'Results Dashboard'!$J$7,0)","v":0},{"$f":"IF($AA15<-'Results Dashboard'!$J$8,$AA15+'Results Dashboard'!$J$8,0)","v":0},{"$f":"IF($AA15<-'Results Dashboard'!$J$9,$AA15+'Results Dashboard'!$J$9,0)","v":0},{"$f":"IF($AA15<-'Results Dashboard'!$J$11,$AA15+'Results Dashboard'!$J$11,0)","v":0},{"$f":"IF($AA15<-'Results Dashboard'!$J$10,$AA15+'Results Dashboard'!$J$10,0)","v":0},null,{"$f":"IF((X15+W15)>0,(X15+W15)*0.5*'User Parameters'!C$48,(X15+W15)*0.5*'User Parameters'!$C$49)","v":0},{"$f":"-'User Parameters'!$C$12*('User Parameters'!$C$13-1)","v":0},0.39699568206208258]
[0.52000392539810669,454.54342697283204,236.36436628978032,0.52000392539810669,{"$f":"'User Parameters'!$C$10","v":40},{"$f":"B16*'User Parameters'!$C$14","v":0},178.17906068305172,0.39199568206208257,0.52000392539810669,{"$f":"IF(UP_RSBasis=\"MLR\",UP_RSTarget_MLR,IF(UP_RSBasis=\"Medical Baseline\",UP_RSTarget_Medlcal,0))","v":0},0,0,0,0,0,0,0,"",0,{"$f":"(S16+C16+'User Parameters'!$C$11)/(B16-F16)","v":0.52000392539810669},{"$f":"IF(T16<'User Parameters'!$J$5,'User Parameters'!$J$5,IF(T16>'User Parameters'!$J$6,'User Parameters'!$J$6,T16))","v":0.52000392539810669},0,0,{"$f":"(B16-C16-F16-E16-S16-V16)/'Results Dashboard'!$D$42","v":0.39199568206208257},{"$f":"IF((X16+W16)>0,(X16+W16)*0.5*((1+'User Parameters'!C$48)^((12+UP_COC_WithholdLag)/12)-1),(X16+W16)*0.5*((1+'User Parameters'!$C$49)^((12+UP_COC_WithholdLag)/12)-1))","v":0},{"$f":"-'User Parameters'!$C$12*('User Parameters'!$C$13-1)","v":0},0.39199568206208257,1,0,0,{"$f":"IF($AA16<-'Results Dashboard'!$J$7,$AA16+'Results Dashboard'!$J$7,0)","v":0},{"$f":"IF($AA16<-'Results Dashboard'!$J$8,$AA16+'Results Dashboard'!$J$8,0)","v":0},{"$f":"IF($AA16<-'Results Dashboard'!$J$9,$AA16+'Results Dashboard'!$J$9,0)","v":0},{"$f":"IF($AA16<-'Results Dashboard'!$J$11,$AA16+'Results Dashboard'!$J$11,0)","v":0},{"$f":"IF($AA16<-'Results Dashboard'!$J$10,$AA16+'Results Dashboard'!$J$10,0)","v":0},null,{"$f":"IF((X16+W16)>0,(X16+W16)*0.5*'User Parameters'!C$48,(X16+W16)*0.5*'User Parameters'!$C$49)","v":0},{"$f":"-'User Parameters'!$C$12*('User Parameters'!$C$13-1)","v":0},0.39199568206208257]
[0.5250039253981067,454.54342697283204,238.63708342464446,0.5250039253981067,{"$f":"'User Parameters'!$C$10","v":40},{"$f":"B17*'User Parameters'!$C$14","v":0},175.90634354818758,0.38699568206208262,0.5250039253981067,{"$f":"IF(UP_RSBasis=\"MLR\",UP_RSTarget_MLR,IF(UP_RSBasis=\"Medical Baseline\",UP_RSTarget_Medlcal,0))","v":0},0,0,0,0,0,0,0,"",0,{"$f":"(S17+C17+'User Parameters'!$C$11)/(B17-F17)","v":0.5250039253981067},{"$f":"IF(T17<'User Parameters'!$J$5,'User Parameters'!$J$5,IF(T17>'User Parameters'!$J$6,'User Parameters'!$J$6,T17))","v":0.5250039253981067},0,0,{"$f":"(B17-C17-F17-E17-S17-V17)/'Results Dashboard'!$D$42","v":0.38699568206208262},{"$f":"IF((X17+W17)>0,(X17+W17)*0.5*((1+'User Parameters'!C$48)^((12+UP_COC_WithholdLag)/12)-1),(X17+W17)*0.5*((1+'User Parameters'!$C$49)^((12+UP_COC_WithholdLag)/12)-1))","v":0},{"$f":"-'User Parameters'!$C$12*('User Parameters'!$C$13-1)","v":0},0.38699568206208262,1,0,0,{"$f":"IF($AA17<-'Results Dashboard'!$J$7,$AA17+'Results Dashboard'!$J$7,0)","v":0},{"$f":"IF($AA17<-'Results Dashboard'!$J$8,$AA17+'Results Dashboard'!$J$8,0)","v":0},{"$f":"IF($AA17<-'Results Dashboard'!$J$9,$AA17+'Results Dashboard'!$J$9,0)","v":0},{"$f":"IF($AA17<-'Results Dashboard'!$J$11,$AA17+'Results Dashboard'!$J$11,0)","v":0},{"$f":"IF($AA17<-'Results Dashboard'!$J$10,$AA17+'Results Dashboard'!$J$10,0)","v":0},null,{"$f":"IF((X17+W17)>0,(X17+W17)*0.5*'User Parameters'!C$48,(X17+W17)*0.5*'User Parameters'!$C$49)","v":0},{"$f":"-'User Parameters'!$C$12*('User Parameters'!$C$13-1)","v":0},0.38699568206208262]
[0.5300039253981067,454.54342697283204,240.90980055950862,0.5300039253981067,{"$f":"'User Parameters'!$C$10","v":40},{"$f":"B18*'User Parameters'!$C$14","v":0},173.63362641332341,0.38199568206208262,0.5300039253981067,{"$f":"IF(UP_RSBasis=\"MLR\",UP_RSTarget_MLR,IF(UP_RSBasis=\"Medical Baseline\",UP_RSTarget_Medlcal,0))","v":0},0,0,0,0,0,0,0,"",0,{"$f":"(S18+C18+'User Parameters'!$C$11)/(B18-F18)","v":0.5300039253981067},{"$f":"IF(T18<'User Parameters'!$J$5,'User Parameters'!$J$5,IF(T18>'User Parameters'!$J$6,'User Parameters'!$J$6,T18))","v":0.5300039253981067},0,0,{"$f":"(B18-C18-F18-E18-S18-V18)/'Results Dashboard'!$D$42","v":0.38199568206208262},{"$f":"IF((X18+W18)>0,(X18+W18)*0.5*((1+'User Parameters'!C$48)^((12+UP_COC_WithholdLag)/12)-1),(X18+W18)*0.5*((1+'User Parameters'!$C$49)^((12+UP_COC_WithholdLag)/12)-1))","v":0},{"$f":"-'User Parameters'!$C$12*('User Parameters'!$C$13-1)","v":0},0.38199568206208262,1,0,0,{"$f":"IF($AA18<-'Results Dashboard'!$J$7,$AA18+'Results Dashboard'!$J$7,0)","v":0},{"$f":"IF($AA18<-'Results Dashboard'!$J$8,$AA18+'Results Dashboard'!$J$8,0)","v":0},{"$f":"IF($AA18<-'Results Dashboard'!$J$9,$AA18+'Results Dashboard'!$J$9,0)","v":0},{"$f":"IF($AA18<-'Results Dashboard'!$J$11,$AA18+'Results Dashboard'!$J$11,0)","v":0},{"$f":"IF($AA18<-'Results Dashboard'!$J$10,$AA18+'Results Dashboard'!$J$10,0)","v":0},null,{"$f":"IF((X18+W18)>0,(X18+W18)*0.5*'User Parameters'!C$48,(X18+W18)*0.5*'User Parameters'!$C$49)","v":0},{"$f":"-'User Parameters'!$C$12*('User Parameters'!$C$13-1)","v":0},0.38199568206208262]
[0.53500392539810671,454.54342697283204,243.18251769437279,0.53500392539810671,{"$f":"'User Parameters'!$C$10","v":40},{"$f":"B19*'User Parameters'!$C$14","v":0},171.36090927845925,0.37699568206208262,0.53500392539810671,{"$f":"IF(UP_RSBasis=\"MLR\",UP_RSTarget_MLR,IF(UP_RSBasis=\"Medical Baseline\",UP_RSTarget_Medlcal,0))","v":0},0,0,0,0,0,0,0,"",0,{"$f":"(S19+C19+'User Parameters'!$C$11)/(B19-F19)","v":0.53500392539810671},{"$f":"IF(T19<'User Parameters'!$J$5,'User Parameters'!$J$5,IF(T19>'User Parameters'!$J$6,'User Parameters'!$J$6,T19))","v":0.53500392539810671},0,0,{"$f":"(B19-C19-F19-E19-S19-V19)/'Results Dashboard'!$D$42","v":0.37699568206208262},{"$f":"IF((X19+W19)>0,(X19+W19)*0.5*((1+'User Parameters'!C$48)^((12+UP_COC_WithholdLag)/12)-1),(X19+W19)*0.5*((1+'User Parameters'!$C$49)^((12+UP_COC_WithholdLag)/12)-1))","v":0},{"$f":"-'User Parameters'!$C$12*('User Parameters'!$C$13-1)","v":0},0.37699568206208262,1,0,0,{"$f":"IF($AA19<-'Results Dashboard'!$J$7,$AA19+'Results Dashboard'!$J$7,0)","v":0},{"$f":"IF($AA19<-'Results Dashboard'!$J$8,$AA19+'Results Dashboard'!$J$8,0)","v":0},{"$f":"IF($AA19<-'Results Dashboard'!$J$9,$AA19+'Results Dashboard'!$J$9,0)","v":0},{"$f":"IF($AA19<-'Results Dashboard'!$J$11,$AA19+'Results Dashboard'!$J$11,0)","v":0},{"$f":"IF($AA19<-'Results Dashboard'!$J$10,$AA19+'Results Dashboard'!$J$10,0)","v":0},null,{"$f":"IF((X19+W19)>0,(X19+W19)*0.5*'User Parameters'!C$48,(X19+W19)*0.5*'User Parameters'!$C$49)","v":0},{"$f":"-'User Parameters'!$C$12*('User Parameters'!$C$13-1)","v":0},0.37699568206208262]
[0.54000392539810671,454.54342697283204,245.45523482923696,0.54000392539810671,{"$f":"'User Parameters'!$C$10","v":40},{"$f":"B20*'User Parameters'!$C$14","v":0},169.08819214359508,0.37199568206208261,0.54000392539810671,{"$f":"IF(UP_RSBasis=\"MLR\",UP_RSTarget_MLR,IF(UP_RSBasis=\"Medical Baseline\",UP_RSTarget_Medlcal,0))","v":0},0,0,0,0,0,0,0,"",0,{"$f":"(S20+C20+'User Parameters'!$C$11)/(B20-F20)","v":0.54000392539810671},{"$f":"IF(T20<'User Parameters'!$J$5,'User Parameters'!$J$5,IF(T20>'User Parameters'!$J$6,'User Parameters'!$J$6,T20))","v":0.54000392539810671},0,0,{"$f":"(B20-C20-F20-E20-S20-V20)/'Results Dashboard'!$D$42","v":0.37199568206208261},{"$f":"IF((X20+W20)>0,(X20+W20)*0.5*((1+'User Parameters'!C$48)^((12+UP_COC_WithholdLag)/12)-1),(X20+W20)*0.5*((1+'User Parameters'!$C$49)^((12+UP_COC_WithholdLag)/12)-1))","v":0},{"$f":"-'User Parameters'!$C$12*('User Parameters'!$C$13-1)","v":0},0.37199568206208261,1,0,0,{"$f":"IF($AA20<-'Results Dashboard'!$J$7,$AA20+'Results Dashboard'!$J$7,0)","v":0},{"$f":"IF($AA20<-'Results Dashboard'!$J$8,$AA20+'Results Dashboard'!$J$8,0)","v":0},{"$f":"IF($AA20<-'Results Dashboard'!$J$9,$AA20+'Results Dashboard'!$J$9,0)","v":0},{"$f":"IF($AA20<-'Results Dashboard'!$J$11,$AA20+'Results Dashboard'!$J$11,0)","v":0},{"$f":"IF($AA20<-'Results Dashboard'!$J$10,$AA20+'Results Dashboard'!$J$10,0)","v":0},null,{"$f":"IF((X20+W20)>0,(X20+W20)*0.5*'User Parameters'!C$48,(X20+W20)*0.5*'User Parameters'!$C$49)","v":0},{"$f":"-'User Parameters'!$C$12*('User Parameters'!$C$13-1)","v":0},0.37199568206208261]
[0.54500392539810671,454.54342697283204,247.72795196410112,0.54500392539810671,{"$f":"'User Parameters'!$C$10","v":40},{"$f":"B21*'User Parameters'!$C$14","v":0},166.81547500873091,0.36699568206208255,0.54500392539810671,{"$f":"IF(UP_RSBasis=\"MLR\",UP_RSTarget_MLR,IF(UP_RSBasis=\"Medical Baseline\",UP_RSTarget_Medlcal,0))","v":0},0,0,0,0,0,0,0,"",0,{"$f":"(S21+C21+'User Parameters'!$C$11)/(B21-F21)","v":0.54500392539810671},{"$f":"IF(T21<'User Parameters'!$J$5,'User Parameters'!$J$5,IF(T21>'User Parameters'!$J$6,'User Parameters'!$J$6,T21))","v":0.54500392539810671},0,0,{"$f":"(B21-C21-F21-E21-S21-V21)/'Results Dashboard'!$D$42","v":0.36699568206208255},{"$f":"IF((X21+W21)>0,(X21+W21)*0.5*((1+'User Parameters'!C$48)^((12+UP_COC_WithholdLag)/12)-1),(X21+W21)*0.5*((1+'User Parameters'!$C$49)^((12+UP_COC_WithholdLag)/12)-1))","v":0},{"$f":"-'User Parameters'!$C$12*('User Parameters'!$C$13-1)","v":0},0.36699568206208255,1,0,0,{"$f":"IF($AA21<-'Results Dashboard'!$J$7,$AA21+'Results Dashboard'!$J$7,0)","v":0},{"$f":"IF($AA21<-'Results Dashboard'!$J$8,$AA21+'Results Dashboard'!$J$8,0)","v":0},{"$f":"IF($AA21<-'Results Dashboard'!$J$9,$AA21+'Results Dashboard'!$J$9,0)","v":0},{"$f":"IF($AA21<-'Results Dashboard'!$J$11,$AA21+'Results Dashboard'!$J$11,0)","v":0},{"$f":"IF($AA21<-'Results Dashboard'!$J$10,$AA21+'Results Dashboard'!$J$10,0)","v":0},null,{"$f":"IF((X21+W21)>0,(X21+W21)*0.5*'User Parameters'!C$48,(X21+W21)*0.5*'User Parameters'!$C$49)","v":0},{"$f":"-'User Parameters'!$C$12*('User Parameters'!$C$13-1)","v":0},0.36699568206208255]
[0.55000392539810672,454.54342697283204,250.00066909896529,0.55000392539810672,{"$f":"'User Parameters'!$C$10","v":40},{"$f":"B22*'User Parameters'!$C$14","v":0},164.54275787386675,0.36199568206208255,0.55000392539810672,{"$f":"IF(UP_RSBasis=\"MLR\",UP_RSTarget_MLR,IF(UP_RSBasis=\"Medical Baseline\",UP_RSTarget_Medlcal,0))","v":0},0,0,0,0,0,0,0,"",0,{"$f":"(S22+C22+'User Parameters'!$C$11)/(B22-F22)","v":0.55000392539810672},{"$f":"IF(T22<'User Parameters'!$J$5,'User Parameters'!$J$5,IF(T22>'User Parameters'!$J$6,'User Parameters'!$J$6,T22))","v":0.55000392539810672},0,0,{"$f":"(B22-C22-F22-E22-S22-V22)/'Results Dashboard'!$D$42","v":0.36199568206208255},{"$f":"IF((X22+W22)>0,(X22+W22)*0.5*((1+'User Parameters'!C$48)^((12+UP_COC_WithholdLag)/12)-1),(X22+W22)*0.5*((1+'User Parameters'!$C$49)^((12+UP_COC_WithholdLag)/12)-1))","v":0},{"$f":"-'User Parameters'!$C$12*('User Parameters'!$C$13-1)","v":0},0.36199568206208255,1,0,0,{"$f":"IF($AA22<-'Results Dashboard'!$J$7,$AA22+'Results Dashboard'!$J$7,0)","v":0},{"$f":"IF($AA22<-'Results Dashboard'!$J$8,$AA22+'Results Dashboard'!$J$8,0)","v":0},{"$f":"IF($AA22<-'Results Dashboard'!$J$9,$AA22+'Results Dashboard'!$J$9,0)","v":0},{"$f":"IF($AA22<-'Results Dashboard'!$J$11,$AA22+'Results Dashboard'!$J$11,0)","v":0},{"$f":"IF($AA22<-'Results Dashboard'!$J$10,$AA22+'Results Dashboard'!$J$10,0)","v":0},null,{"$f":"IF((X22+W22)>0,(X22+W22)*0.5*'User Parameters'!C$48,(X22+W22)*0.5*'User Parameters'!$C$49)","v":0},{"$f":"-'User Parameters'!$C$12*('User Parameters'!$C$13-1)","v":0},0.36199568206208255]
[0.55500392539810672,454.54342697283204,252.27338623382946,0.55500392539810672,{"$f":"'User Parameters'!$C$10","v":40},{"$f":"B23*'User Parameters'!$C$14","v":0},162.27004073900258,0.35699568206208254,0.55500392539810672,{"$f":"IF(UP_RSBasis=\"MLR\",UP_RSTarget_MLR,IF(UP_RSBasis=\"Medical Baseline\",UP_RSTarget_Medlcal,0))","v":0},0,0,0,0,0,0,0,"",0,{"$f":"(S23+C23+'User Parameters'!$C$11)/(B23-F23)","v":0.55500392539810672},{"$f":"IF(T23<'User Parameters'!$J$5,'User Parameters'!$J$5,IF(T23>'User Parameters'!$J$6,'User Parameters'!$J$6,T23))","v":0.55500392539810672},0,0,{"$f":"(B23-C23-F23-E23-S23-V23)/'Results Dashboard'!$D$42","v":0.35699568206208254},{"$f":"IF((X23+W23)>0,(X23+W23)*0.5*((1+'User Parameters'!C$48)^((12+UP_COC_WithholdLag)/12)-1),(X23+W23)*0.5*((1+'User Parameters'!$C$49)^((12+UP_COC_WithholdLag)/12)-1))","v":0},{"$f":"-'User Parameters'!$C$12*('User Parameters'!$C$13-1)","v":0},0.35699568206208254,1,0,0,{"$f":"IF($AA23<-'Results Dashboard'!$J$7,$AA23+'Results Dashboard'!$J$7,0)","v":0},{"$f":"IF($AA23<-'Results Dashboard'!$J$8,$AA23+'Results Dashboard'!$J$8,0)","v":0},{"$f":"IF($AA23<-'Results Dashboard'!$J$9,$AA23+'Results Dashboard'!$J$9,0)","v":0},{"$f":"IF($AA23<-'Results Dashboard'!$J$11,$AA23+'Results Dashboard'!$J$11,0)","v":0},{"$f":"IF($AA23<-'Results Dashboard'!$J$10,$AA23+'Results Dashboard'!$J$10,0)","v":0},null,{"$f":"IF((X23+W23)>0,(X23+W23)*0.5*'User Parameters'!C$48,(X23+W23)*0.5*'User Parameters'!$C$49)","v":0},{"$f":"-'User Parameters'!$C$12*('User Parameters'!$C$13-1)","v":0},0.35699568206208254]
[0.56000392539810673,454.54342697283204,254.54610336869359,0.56000392539810673,{"$f":"'User Parameters'!$C$10","v":40},{"$f":"B24*'User Parameters'!$C$14","v":0},159.99732360413844,0.35199568206208259,0.56000392539810673,{"$f":"IF(UP_RSBasis=\"MLR\",UP_RSTarget_MLR,IF(UP_RSBasis=\"Medical Baseline\",UP_RSTarget_Medlcal,0))","v":0},0,0,0,0,0,0,0,"",0,{"$f":"(S24+C24+'User Parameters'!$C$11)/(B24-F24)","v":0.56000392539810673},{"$f":"IF(T24<'User Parameters'!$J$5,'User Parameters'!$J$5,IF(T24>'User Parameters'!$J$6,'User Parameters'!$J$6,T24))","v":0.56000392539810673},0,0,{"$f":"(B24-C24-F24-E24-S24-V24)/'Results Dashboard'!$D$42","v":0.35199568206208259},{"$f":"IF((X24+W24)>0,(X24+W24)*0.5*((1+'User Parameters'!C$48)^((12+UP_COC_WithholdLag)/12)-1),(X24+W24)*0.5*((1+'User Parameters'!$C$49)^((12+UP_COC_WithholdLag)/12)-1))","v":0},{"$f":"-'User Parameters'!$C$12*('User Parameters'!$C$13-1)","v":0},0.35199568206208259,1,0,0,{"$f":"IF($AA24<-'Results Dashboard'!$J$7,$AA24+'Results Dashboard'!$J$7,0)","v":0},{"$f":"IF($AA24<-'Results Dashboard'!$J$8,$AA24+'Results Dashboard'!$J$8,0)","v":0},{"$f":"IF($AA24<-'Results Dashboard'!$J$9,$AA24+'Results Dashboard'!$J$9,0)","v":0},{"$f":"IF($AA24<-'Results Dashboard'!$J$11,$AA24+'Results Dashboard'!$J$11,0)","v":0},{"$f":"IF($AA24<-'Results Dashboard'!$J$10,$AA24+'Results Dashboard'!$J$10,0)","v":0},null,{"$f":"IF((X24+W24)>0,(X24+W24)*0.5*'User Parameters'!C$48,(X24+W24)*0.5*'User Parameters'!$C$49)","v":0},{"$f":"-'User Parameters'!$C$12*('User Parameters'!$C$13-1)","v":0},0.35199568206208259]
[0.56500392539810673,454.54342697283204,256.81882050355779,0.56500392539810673,{"$f":"'User Parameters'!$C$10","v":40},{"$f":"B25*'User Parameters'!$C$14","v":0},157.72460646927425,0.34699568206208253,0.56500392539810673,{"$f":"IF(UP_RSBasis=\"MLR\",UP_RSTarget_MLR,IF(UP_RSBasis=\"Medical Baseline\",UP_RSTarget_Medlcal,0))","v":0},0,0,0,0,0,0,0,"",0,{"$f":"(S25+C25+'User Parameters'!$C$11)/(B25-F25)","v":0.56500392539810673},{"$f":"IF(T25<'User Parameters'!$J$5,'User Parameters'!$J$5,IF(T25>'User Parameters'!$J$6,'User Parameters'!$J$6,T25))","v":0.56500392539810673},0,0,{"$f":"(B25-C25-F25-E25-S25-V25)/'Results Dashboard'!$D$42","v":0.34699568206208253},{"$f":"IF((X25+W25)>0,(X25+W25)*0.5*((1+'User Parameters'!C$48)^((12+UP_COC_WithholdLag)/12)-1),(X25+W25)*0.5*((1+'User Parameters'!$C$49)^((12+UP_COC_WithholdLag)/12)-1))","v":0},{"$f":"-'User Parameters'!$C$12*('User Parameters'!$C$13-1)","v":0},0.34699568206208253,1,0,0,{"$f":"IF($AA25<-'Results Dashboard'!$J$7,$AA25+'Results Dashboard'!$J$7,0)","v":0},{"$f":"IF($AA25<-'Results Dashboard'!$J$8,$AA25+'Results Dashboard'!$J$8,0)","v":0},{"$f":"IF($AA25<-'Results Dashboard'!$J$9,$AA25+'Results Dashboard'!$J$9,0)","v":0},{"$f":"IF($AA25<-'Results Dashboard'!$J$11,$AA25+'Results Dashboard'!$J$11,0)","v":0},{"$f":"IF($AA25<-'Results Dashboard'!$J$10,$AA25+'Results Dashboard'!$J$10,0)","v":0},null,{"$f":"IF((X25+W25)>0,(X25+W25)*0.5*'User Parameters'!C$48,(X25+W25)*0.5*'User Parameters'!$C$49)","v":0},{"$f":"-'User Parameters'!$C$12*('User Parameters'!$C$13-1)","v":0},0.34699568206208253]
[0.57000392539810674,454.54342697283204,259.09153763842193,0.57000392539810674,{"$f":"'User Parameters'!$C$10","v":40},{"$f":"B26*'User Parameters'!$C$14","v":0},155.45188933441011,0.34199568206208258,0.57000392539810674,{"$f":"IF(UP_RSBasis=\"MLR\",UP_RSTarget_MLR,IF(UP_RSBasis=\"Medical Baseline\",UP_RSTarget_Medlcal,0))","v":0},0,0,0,0,0,0,0,"",0,{"$f":"(S26+C26+'User Parameters'!$C$11)/(B26-F26)","v":0.57000392539810674},{"$f":"IF(T26<'User Parameters'!$J$5,'User Parameters'!$J$5,IF(T26>'User Parameters'!$J$6,'User Parameters'!$J$6,T26))","v":0.57000392539810674},0,0,{"$f":"(B26-C26-F26-E26-S26-V26)/'Results Dashboard'!$D$42","v":0.34199568206208258},{"$f":"IF((X26+W26)>0,(X26+W26)*0.5*((1+'User Parameters'!C$48)^((12+UP_COC_WithholdLag)/12)-1),(X26+W26)*0.5*((1+'User Parameters'!$C$49)^((12+UP_COC_WithholdLag)/12)-1))","v":0},{"$f":"-'User Parameters'!$C$12*('User Parameters'!$C$13-1)","v":0},0.34199568206208258,1,0,0,{"$f":"IF($AA26<-'Results Dashboard'!$J$7,$AA26+'Results Dashboard'!$J$7,0)","v":0},{"$f":"IF($AA26<-'Results Dashboard'!$J$8,$AA26+'Results Dashboard'!$J$8,0)","v":0},{"$f":"IF($AA26<-'Results Dashboard'!$J$9,$AA26+'Results Dashboard'!$J$9,0)","v":0},{"$f":"IF($AA26<-'Results Dashboard'!$J$11,$AA26+'Results Dashboard'!$J$11,0)","v":0},{"$f":"IF($AA26<-'Results Dashboard'!$J$10,$AA26+'Results Dashboard'!$J$10,0)","v":0},null,{"$f":"IF((X26+W26)>0,(X26+W26)*0.5*'User Parameters'!C$48,(X26+W26)*0.5*'User Parameters'!$C$49)","v":0},{"$f":"-'User Parameters'!$C$12*('User Parameters'!$C$13-1)","v":0},0.34199568206208258]
[0.57500392539810674,454.54342697283204,261.36425477328612,0.57500392539810685,{"$f":"'User Parameters'!$C$10","v":40},{"$f":"B27*'User Parameters'!$C$14","v":0},153.17917219954592,0.33699568206208247,0.57500392539810685,{"$f":"IF(UP_RSBasis=\"MLR\",UP_RSTarget_MLR,IF(UP_RSBasis=\"Medical Baseline\",UP_RSTarget_Medlcal,0))","v":0},0,0,0,0,0,0,0,"",0,{"$f":"(S27+C27+'User Parameters'!$C$11)/(B27-F27)","v":0.57500392539810685},{"$f":"IF(T27<'User Parameters'!$J$5,'User Parameters'!$J$5,IF(T27>'User Parameters'!$J$6,'User Parameters'!$J$6,T27))","v":0.57500392539810685},0,0,{"$f":"(B27-C27-F27-E27-S27-V27)/'Results Dashboard'!$D$42","v":0.33699568206208247},{"$f":"IF((X27+W27)>0,(X27+W27)*0.5*((1+'User Parameters'!C$48)^((12+UP_COC_WithholdLag)/12)-1),(X27+W27)*0.5*((1+'User Parameters'!$C$49)^((12+UP_COC_WithholdLag)/12)-1))","v":0},{"$f":"-'User Parameters'!$C$12*('User Parameters'!$C$13-1)","v":0},0.33699568206208247,1,0,0,{"$f":"IF($AA27<-'Results Dashboard'!$J$7,$AA27+'Results Dashboard'!$J$7,0)","v":0},{"$f":"IF($AA27<-'Results Dashboard'!$J$8,$AA27+'Results Dashboard'!$J$8,0)","v":0},{"$f":"IF($AA27<-'Results Dashboard'!$J$9,$AA27+'Results Dashboard'!$J$9,0)","v":0},{"$f":"IF($AA27<-'Results Dashboard'!$J$11,$AA27+'Results Dashboard'!$J$11,0)","v":0},{"$f":"IF($AA27<-'Results Dashboard'!$J$10,$AA27+'Results Dashboard'!$J$10,0)","v":0},null,{"$f":"IF((X27+W27)>0,(X27+W27)*0.5*'User Parameters'!C$48,(X27+W27)*0.5*'User Parameters'!$C$49)","v":0},{"$f":"-'User Parameters'!$C$12*('User Parameters'!$C$13-1)","v":0},0.33699568206208247]
[0.58000392539810675,454.54342697283204,263.63697190815026,0.58000392539810675,{"$f":"'User Parameters'!$C$10","v":40},{"$f":"B28*'User Parameters'!$C$14","v":0},150.90645506468178,0.33199568206208252,0.58000392539810675,{"$f":"IF(UP_RSBasis=\"MLR\",UP_RSTarget_MLR,IF(UP_RSBasis=\"Medical Baseline\",UP_RSTarget_Medlcal,0))","v":0},0,0,0,0,0,0,0,"",0,{"$f":"(S28+C28+'User Parameters'!$C$11)/(B28-F28)","v":0.58000392539810675},{"$f":"IF(T28<'User Parameters'!$J$5,'User Parameters'!$J$5,IF(T28>'User Parameters'!$J$6,'User Parameters'!$J$6,T28))","v":0.58000392539810675},0,0,{"$f":"(B28-C28-F28-E28-S28-V28)/'Results Dashboard'!$D$42","v":0.33199568206208252},{"$f":"IF((X28+W28)>0,(X28+W28)*0.5*((1+'User Parameters'!C$48)^((12+UP_COC_WithholdLag)/12)-1),(X28+W28)*0.5*((1+'User Parameters'!$C$49)^((12+UP_COC_WithholdLag)/12)-1))","v":0},{"$f":"-'User Parameters'!$C$12*('User Parameters'!$C$13-1)","v":0},0.33199568206208252,1,0,0,{"$f":"IF($AA28<-'Results Dashboard'!$J$7,$AA28+'Results Dashboard'!$J$7,0)","v":0},{"$f":"IF($AA28<-'Results Dashboard'!$J$8,$AA28+'Results Dashboard'!$J$8,0)","v":0},{"$f":"IF($AA28<-'Results Dashboard'!$J$9,$AA28+'Results Dashboard'!$J$9,0)","v":0},{"$f":"IF($AA28<-'Results Dashboard'!$J$11,$AA28+'Results Dashboard'!$J$11,0)","v":0},{"$f":"IF($AA28<-'Results Dashboard'!$J$10,$AA28+'Results Dashboard'!$J$10,0)","v":0},null,{"$f":"IF((X28+W28)>0,(X28+W28)*0.5*'User Parameters'!C$48,(X28+W28)*0.5*'User Parameters'!$C$49)","v":0},{"$f":"-'User Parameters'!$C$12*('User Parameters'!$C$13-1)","v":0},0.33199568206208252]
[0.58500392539810675,454.54342697283204,265.9096890430144,0.58500392539810675,{"$f":"'User Parameters'!$C$10","v":40},{"$f":"B29*'User Parameters'!$C$14","v":0},148.63373792981764,0.32699568206208257,0.58500392539810675,{"$f":"IF(UP_RSBasis=\"MLR\",UP_RSTarget_MLR,IF(UP_RSBasis=\"Medical Baseline\",UP_RSTarget_Medlcal,0))","v":0},0,0,0,0,0,0,0,"",0,{"$f":"(S29+C29+'User Parameters'!$C$11)/(B29-F29)","v":0.58500392539810675},{"$f":"IF(T29<'User Parameters'!$J$5,'User Parameters'!$J$5,IF(T29>'User Parameters'!$J$6,'User Parameters'!$J$6,T29))","v":0.58500392539810675},0,0,{"$f":"(B29-C29-F29-E29-S29-V29)/'Results Dashboard'!$D$42","v":0.32699568206208257},{"$f":"IF((X29+W29)>0,(X29+W29)*0.5*((1+'User Parameters'!C$48)^((12+UP_COC_WithholdLag)/12)-1),(X29+W29)*0.5*((1+'User Parameters'!$C$49)^((12+UP_COC_WithholdLag)/12)-1))","v":0},{"$f":"-'User Parameters'!$C$12*('User Parameters'!$C$13-1)","v":0},0.32699568206208257,1,0,0,{"$f":"IF($AA29<-'Results Dashboard'!$J$7,$AA29+'Results Dashboard'!$J$7,0)","v":0},{"$f":"IF($AA29<-'Results Dashboard'!$J$8,$AA29+'Results Dashboard'!$J$8,0)","v":0},{"$f":"IF($AA29<-'Results Dashboard'!$J$9,$AA29+'Results Dashboard'!$J$9,0)","v":0},{"$f":"IF($AA29<-'Results Dashboard'!$J$11,$AA29+'Results Dashboard'!$J$11,0)","v":0},{"$f":"IF($AA29<-'Results Dashboard'!$J$10,$AA29+'Results Dashboard'!$J$10,0)","v":0},null,{"$f":"IF((X29+W29)>0,(X29+W29)*0.5*'User Parameters'!C$48,(X29+W29)*0.5*'User Parameters'!$C$49)","v":0},{"$f":"-'User Parameters'!$C$12*('User Parameters'!$C$13-1)","v":0},0.32699568206208257]
[0.59000392539810675,454.54342697283204,268.18240617787859,0.59000392539810675,{"$f":"'User Parameters'!$C$10","v":40},{"$f":"B30*'User Parameters'!$C$14","v":0},146.36102079495345,0.32199568206208251,0.59000392539810675,{"$f":"IF(UP_RSBasis=\"MLR\",UP_RSTarget_MLR,IF(UP_RSBasis=\"Medical Baseline\",UP_RSTarget_Medlcal,0))","v":0},0,0,0,0,0,0,0,"",0,{"$f":"(S30+C30+'User Parameters'!$C$11)/(B30-F30)","v":0.59000392539810675},{"$f":"IF(T30<'User Parameters'!$J$5,'User Parameters'!$J$5,IF(T30>'User Parameters'!$J$6,'User Parameters'!$J$6,T30))","v":0.59000392539810675},0,0,{"$f":"(B30-C30-F30-E30-S30-V30)/'Results Dashboard'!$D$42","v":0.32199568206208251},{"$f":"IF((X30+W30)>0,(X30+W30)*0.5*((1+'User Parameters'!C$48)^((12+UP_COC_WithholdLag)/12)-1),(X30+W30)*0.5*((1+'User Parameters'!$C$49)^((12+UP_COC_WithholdLag)/12)-1))","v":0},{"$f":"-'User Parameters'!$C$12*('User Parameters'!$C$13-1)","v":0},0.32199568206208251,1,0,0,{"$f":"IF($AA30<-'Results Dashboard'!$J$7,$AA30+'Results Dashboard'!$J$7,0)","v":0},{"$f":"IF($AA30<-'Results Dashboard'!$J$8,$AA30+'Results Dashboard'!$J$8,0)","v":0},{"$f":"IF($AA30<-'Results Dashboard'!$J$9,$AA30+'Results Dashboard'!$J$9,0)","v":0},{"$f":"IF($AA30<-'Results Dashboard'!$J$11,$AA30+'Results Dashboard'!$J$11,0)","v":0},{"$f":"IF($AA30<-'Results Dashboard'!$J$10,$AA30+'Results Dashboard'!$J$10,0)","v":0},null,{"$f":"IF((X30+W30)>0,(X30+W30)*0.5*'User Parameters'!C$48,(X30+W30)*0.5*'User Parameters'!$C$49)","v":0},{"$f":"-'User Parameters'!$C$12*('User Parameters'!$C$13-1)","v":0},0.32199568206208251]
[0.59500392539810676,454.54342697283204,270.45512331274273,0.59500392539810676,{"$f":"'User Parameters'!$C$10","v":40},{"$f":"B31*'User Parameters'!$C$14","v":0},144.08830366008931,0.31699568206208256,0.59500392539810676,{"$f":"IF(UP_RSBasis=\"MLR\",UP_RSTarget_MLR,IF(UP_RSBasis=\"Medical Baseline\",UP_RSTarget_Medlcal,0))","v":0},0,0,0,0,0,0,0,"",0,{"$f":"(S31+C31+'User Parameters'!$C$11)/(B31-F31)","v":0.59500392539810676},{"$f":"IF(T31<'User Parameters'!$J$5,'User Parameters'!$J$5,IF(T31>'User Parameters'!$J$6,'User Parameters'!$J$6,T31))","v":0.59500392539810676},0,0,{"$f":"(B31-C31-F31-E31-S31-V31)/'Results Dashboard'!$D$42","v":0.31699568206208256},{"$f":"IF((X31+W31)>0,(X31+W31)*0.5*((1+'User Parameters'!C$48)^((12+UP_COC_WithholdLag)/12)-1),(X31+W31)*0.5*((1+'User Parameters'!$C$49)^((12+UP_COC_WithholdLag)/12)-1))","v":0},{"$f":"-'User Parameters'!$C$12*('User Parameters'!$C$13-1)","v":0},0.31699568206208256,1,0,0,{"$f":"IF($AA31<-'Results Dashboard'!$J$7,$AA31+'Results Dashboard'!$J$7,0)","v":0},{"$f":"IF($AA31<-'Results Dashboard'!$J$8,$AA31+'Results Dashboard'!$J$8,0)","v":0},{"$f":"IF($AA31<-'Results Dashboard'!$J$9,$AA31+'Results Dashboard'!$J$9,0)","v":0},{"$f":"IF($AA31<-'Results Dashboard'!$J$11,$AA31+'Results Dashboard'!$J$11,0)","v":0},{"$f":"IF($AA31<-'Results Dashboard'!$J$10,$AA31+'Results Dashboard'!$J$10,0)","v":0},null,{"$f":"IF((X31+W31)>0,(X31+W31)*0.5*'User Parameters'!C$48,(X31+W31)*0.5*'User Parameters'!$C$49)","v":0},{"$f":"-'User Parameters'!$C$12*('User Parameters'!$C$13-1)","v":0},0.31699568206208256]
[0.60000392539810676,454.54342697283204,272.72784044760692,0.60000392539810676,{"$f":"'User Parameters'!$C$10","v":40},{"$f":"B32*'User Parameters'!$C$14","v":0},141.81558652522511,0.3119956820620825,0.60000392539810676,{"$f":"IF(UP_RSBasis=\"MLR\",UP_RSTarget_MLR,IF(UP_RSBasis=\"Medical Baseline\",UP_RSTarget_Medlcal,0))","v":0},0,0,0,0,0,0,0,"",0,{"$f":"(S32+C32+'User Parameters'!$C$11)/(B32-F32)","v":0.60000392539810676},{"$f":"IF(T32<'User Parameters'!$J$5,'User Parameters'!$J$5,IF(T32>'User Parameters'!$J$6,'User Parameters'!$J$6,T32))","v":0.60000392539810676},0,0,{"$f":"(B32-C32-F32-E32-S32-V32)/'Results Dashboard'!$D$42","v":0.3119956820620825},{"$f":"IF((X32+W32)>0,(X32+W32)*0.5*((1+'User Parameters'!C$48)^((12+UP_COC_WithholdLag)/12)-1),(X32+W32)*0.5*((1+'User Parameters'!$C$49)^((12+UP_COC_WithholdLag)/12)-1))","v":0},{"$f":"-'User Parameters'!$C$12*('User Parameters'!$C$13-1)","v":0},0.3119956820620825,1,0,0,{"$f":"IF($AA32<-'Results Dashboard'!$J$7,$AA32+'Results Dashboard'!$J$7,0)","v":0},{"$f":"IF($AA32<-'Results Dashboard'!$J$8,$AA32+'Results Dashboard'!$J$8,0)","v":0},{"$f":"IF($AA32<-'Results Dashboard'!$J$9,$AA32+'Results Dashboard'!$J$9,0)","v":0},{"$f":"IF($AA32<-'Results Dashboard'!$J$11,$AA32+'Results Dashboard'!$J$11,0)","v":0},{"$f":"IF($AA32<-'Results Dashboard'!$J$10,$AA32+'Results Dashboard'!$J$10,0)","v":0},null,{"$f":"IF((X32+W32)>0,(X32+W32)*0.5*'User Parameters'!C$48,(X32+W32)*0.5*'User Parameters'!$C$49)","v":0},{"$f":"-'User Parameters'!$C$12*('User Parameters'!$C$13-1)","v":0},0.3119956820620825]
[0.60500392539810677,454.54342697283204,275.00055758247106,0.60500392539810677,{"$f":"'User Parameters'!$C$10","v":40},{"$f":"B33*'User Parameters'!$C$14","v":0},139.54286939036098,0.30699568206208255,0.60500392539810677,{"$f":"IF(UP_RSBasis=\"MLR\",UP_RSTarget_MLR,IF(UP_RSBasis=\"Medical Baseline\",UP_RSTarget_Medlcal,0))","v":0},0,0,0,0,0,0,0,"",0,{"$f":"(S33+C33+'User Parameters'!$C$11)/(B33-F33)","v":0.60500392539810677},{"$f":"IF(T33<'User Parameters'!$J$5,'User Parameters'!$J$5,IF(T33>'User Parameters'!$J$6,'User Parameters'!$J$6,T33))","v":0.60500392539810677},0,0,{"$f":"(B33-C33-F33-E33-S33-V33)/'Results Dashboard'!$D$42","v":0.30699568206208255},{"$f":"IF((X33+W33)>0,(X33+W33)*0.5*((1+'User Parameters'!C$48)^((12+UP_COC_WithholdLag)/12)-1),(X33+W33)*0.5*((1+'User Parameters'!$C$49)^((12+UP_COC_WithholdLag)/12)-1))","v":0},{"$f":"-'User Parameters'!$C$12*('User Parameters'!$C$13-1)","v":0},0.30699568206208255,1,0,0,{"$f":"IF($AA33<-'Results Dashboard'!$J$7,$AA33+'Results Dashboard'!$J$7,0)","v":0},{"$f":"IF($AA33<-'Results Dashboard'!$J$8,$AA33+'Results Dashboard'!$J$8,0)","v":0},{"$f":"IF($AA33<-'Results Dashboard'!$J$9,$AA33+'Results Dashboard'!$J$9,0)","v":0},{"$f":"IF($AA33<-'Results Dashboard'!$J$11,$AA33+'Results Dashboard'!$J$11,0)","v":0},{"$f":"IF($AA33<-'Results Dashboard'!$J$10,$AA33+'Results Dashboard'!$J$10,0)","v":0},null,{"$f":"IF((X33+W33)>0,(X33+W33)*0.5*'User Parameters'!C$48,(X33+W33)*0.5*'User Parameters'!$C$49)","v":0},{"$f":"-'User Parameters'!$C$12*('User Parameters'!$C$13-1)","v":0},0.30699568206208255]
[0.61000392539810677,454.54342697283204,277.27327471733525,0.61000392539810688,{"$f":"'User Parameters'!$C$10","v":40},{"$f":"B34*'User Parameters'!$C$14","v":0},137.27015225549678,0.30199568206208244,0.61000392539810688,{"$f":"IF(UP_RSBasis=\"MLR\",UP_RSTarget_MLR,IF(UP_RSBasis=\"Medical Baseline\",UP_RSTarget_Medlcal,0))","v":0},0,0,0,0,0,0,0,"",0,{"$f":"(S34+C34+'User Parameters'!$C$11)/(B34-F34)","v":0.61000392539810688},{"$f":"IF(T34<'User Parameters'!$J$5,'User Parameters'!$J$5,IF(T34>'User Parameters'!$J$6,'User Parameters'!$J$6,T34))","v":0.61000392539810688},0,0,{"$f":"(B34-C34-F34-E34-S34-V34)/'Results Dashboard'!$D$42","v":0.30199568206208244},{"$f":"IF((X34+W34)>0,(X34+W34)*0.5*((1+'User Parameters'!C$48)^((12+UP_COC_WithholdLag)/12)-1),(X34+W34)*0.5*((1+'User Parameters'!$C$49)^((12+UP_COC_WithholdLag)/12)-1))","v":0},{"$f":"-'User Parameters'!$C$12*('User Parameters'!$C$13-1)","v":0},0.30199568206208244,0.99999999999999989,0,0,{"$f":"IF($AA34<-'Results Dashboard'!$J$7,$AA34+'Results Dashboard'!$J$7,0)","v":0},{"$f":"IF($AA34<-'Results Dashboard'!$J$8,$AA34+'Results Dashboard'!$J$8,0)","v":0},{"$f":"IF($AA34<-'Results Dashboard'!$J$9,$AA34+'Results Dashboard'!$J$9,0)","v":0},{"$f":"IF($AA34<-'Results Dashboard'!$J$11,$AA34+'Results Dashboard'!$J$11,0)","v":0},{"$f":"IF($AA34<-'Results Dashboard'!$J$10,$AA34+'Results Dashboard'!$J$10,0)","v":0},null,{"$f":"IF((X34+W34)>0,(X34+W34)*0.5*'User Parameters'!C$48,(X34+W34)*0.5*'User Parameters'!$C$49)","v":0},{"$f":"-'User Parameters'!$C$12*('User Parameters'!$C$13-1)","v":0},0.30199568206208244]
[0.61500392539810678,454.54342697283204,279.54599185219939,0.61500392539810678,{"$f":"'User Parameters'!$C$10","v":40},{"$f":"B35*'User Parameters'!$C$14","v":0},134.99743512063264,0.29699568206208249,0.61500392539810678,{"$f":"IF(UP_RSBasis=\"MLR\",UP_RSTarget_MLR,IF(UP_RSBasis=\"Medical Baseline\",UP_RSTarget_Medlcal,0))","v":0},0,0,0,0,0,0,0,"",0,{"$f":"(S35+C35+'User Parameters'!$C$11)/(B35-F35)","v":0.61500392539810678},{"$f":"IF(T35<'User Parameters'!$J$5,'User Parameters'!$J$5,IF(T35>'User Parameters'!$J$6,'User Parameters'!$J$6,T35))","v":0.61500392539810678},0,0,{"$f":"(B35-C35-F35-E35-S35-V35)/'Results Dashboard'!$D$42","v":0.29699568206208249},{"$f":"IF((X35+W35)>0,(X35+W35)*0.5*((1+'User Parameters'!C$48)^((12+UP_COC_WithholdLag)/12)-1),(X35+W35)*0.5*((1+'User Parameters'!$C$49)^((12+UP_COC_WithholdLag)/12)-1))","v":0},{"$f":"-'User Parameters'!$C$12*('User Parameters'!$C$13-1)","v":0},0.29699568206208249,0.99999999999999956,9.9920072216264089E-16,9.9920072216264089E-16,{"$f":"IF($AA35<-'Results Dashboard'!$J$7,$AA35+'Results Dashboard'!$J$7,0)","v":0},{"$f":"IF($AA35<-'Results Dashboard'!$J$8,$AA35+'Results Dashboard'!$J$8,0)","v":0},{"$f":"IF($AA35<-'Results Dashboard'!$J$9,$AA35+'Results Dashboard'!$J$9,0)","v":0},{"$f":"IF($AA35<-'Results Dashboard'!$J$11,$AA35+'Results Dashboard'!$J$11,0)","v":0},{"$f":"IF($AA35<-'Results Dashboard'!$J$10,$AA35+'Results Dashboard'!$J$10,0)","v":0},null,{"$f":"IF((X35+W35)>0,(X35+W35)*0.5*'User Parameters'!C$48,(X35+W35)*0.5*'User Parameters'!$C$49)","v":0},{"$f":"-'User Parameters'!$C$12*('User Parameters'!$C$13-1)","v":0},0.29699568206208249]
[0.62000392539810678,454.54342697283204,281.81870898706353,0.62000392539810678,{"$f":"'User Parameters'!$C$10","v":40},{"$f":"B36*'User Parameters'!$C$14","v":0},132.72471798576851,0.29199568206208254,0.62000392539810678,{"$f":"IF(UP_RSBasis=\"MLR\",UP_RSTarget_MLR,IF(UP_RSBasis=\"Medical Baseline\",UP_RSTarget_Medlcal,0))","v":0},0,0,0,0,0,0,0,"",0,{"$f":"(S36+C36+'User Parameters'!$C$11)/(B36-F36)","v":0.62000392539810678},{"$f":"IF(T36<'User Parameters'!$J$5,'User Parameters'!$J$5,IF(T36>'User Parameters'!$J$6,'User Parameters'!$J$6,T36))","v":0.62000392539810678},0,0,{"$f":"(B36-C36-F36-E36-S36-V36)/'Results Dashboard'!$D$42","v":0.29199568206208254},{"$f":"IF((X36+W36)>0,(X36+W36)*0.5*((1+'User Parameters'!C$48)^((12+UP_COC_WithholdLag)/12)-1),(X36+W36)*0.5*((1+'User Parameters'!$C$49)^((12+UP_COC_WithholdLag)/12)-1))","v":0},{"$f":"-'User Parameters'!$C$12*('User Parameters'!$C$13-1)","v":0},0.29199568206208254,0.99999999999999856,3.4416913763379853E-15,3.4416913763379853E-15,{"$f":"IF($AA36<-'Results Dashboard'!$J$7,$AA36+'Results Dashboard'!$J$7,0)","v":0},{"$f":"IF($AA36<-'Results Dashboard'!$J$8,$AA36+'Results Dashboard'!$J$8,0)","v":0},{"$f":"IF($AA36<-'Results Dashboard'!$J$9,$AA36+'Results Dashboard'!$J$9,0)","v":0},{"$f":"IF($AA36<-'Results Dashboard'!$J$11,$AA36+'Results Dashboard'!$J$11,0)","v":0},{"$f":"IF($AA36<-'Results Dashboard'!$J$10,$AA36+'Results Dashboard'!$J$10,0)","v":0},null,{"$f":"IF((X36+W36)>0,(X36+W36)*0.5*'User Parameters'!C$48,(X36+W36)*0.5*'User Parameters'!$C$49)","v":0},{"$f":"-'User Parameters'!$C$12*('User Parameters'!$C$13-1)","v":0},0.29199568206208254]
[0.62500392539810679,454.54342697283204,284.09142612192773,0.62500392539810679,{"$f":"'User Parameters'!$C$10","v":40},{"$f":"B37*'User Parameters'!$C$14","v":0},130.45200085090431,0.28699568206208248,0.62500392539810679,{"$f":"IF(UP_RSBasis=\"MLR\",UP_RSTarget_MLR,IF(UP_RSBasis=\"Medical Baseline\",UP_RSTarget_Medlcal,0))","v":0},0,0,0,0,0,0,0,"",0,{"$f":"(S37+C37+'User Parameters'!$C$11)/(B37-F37)","v":0.62500392539810679},{"$f":"IF(T37<'User Parameters'!$J$5,'User Parameters'!$J$5,IF(T37>'User Parameters'!$J$6,'User Parameters'!$J$6,T37))","v":0.62500392539810679},0,0,{"$f":"(B37-C37-F37-E37-S37-V37)/'Results Dashboard'!$D$42","v":0.28699568206208248},{"$f":"IF((X37+W37)>0,(X37+W37)*0.5*((1+'User Parameters'!C$48)^((12+UP_COC_WithholdLag)/12)-1),(X37+W37)*0.5*((1+'User Parameters'!$C$49)^((12+UP_COC_WithholdLag)/12)-1))","v":0},{"$f":"-'User Parameters'!$C$12*('User Parameters'!$C$13-1)","v":0},0.28699568206208248,0.99999999999999512,1.1213252548714081E-14,1.1213252548714081E-14,{"$f":"IF($AA37<-'Results Dashboard'!$J$7,$AA37+'Results Dashboard'!$J$7,0)","v":0},{"$f":"IF($AA37<-'Results Dashboard'!$J$8,$AA37+'Results Dashboard'!$J$8,0)","v":0},{"$f":"IF($AA37<-'Results Dashboard'!$J$9,$AA37+'Results Dashboard'!$J$9,0)","v":0},{"$f":"IF($AA37<-'Results Dashboard'!$J$11,$AA37+'Results Dashboard'!$J$11,0)","v":0},{"$f":"IF($AA37<-'Results Dashboard'!$J$10,$AA37+'Results Dashboard'!$J$10,0)","v":0},null,{"$f":"IF((X37+W37)>0,(X37+W37)*0.5*'User Parameters'!C$48,(X37+W37)*0.5*'User Parameters'!$C$49)","v":0},{"$f":"-'User Parameters'!$C$12*('User Parameters'!$C$13-1)","v":0},0.28699568206208248]
[0.63000392539810679,454.54342697283204,286.36414325679186,0.63000392539810679,{"$f":"'User Parameters'!$C$10","v":40},{"$f":"B38*'User Parameters'!$C$14","v":0},128.17928371604017,0.28199568206208253,0.63000392539810679,{"$f":"IF(UP_RSBasis=\"MLR\",UP_RSTarget_MLR,IF(UP_RSBasis=\"Medical Baseline\",UP_RSTarget_Medlcal,0))","v":0},0,0,0,0,0,0,0,"",0,{"$f":"(S38+C38+'User Parameters'!$C$11)/(B38-F38)","v":0.63000392539810679},{"$f":"IF(T38<'User Parameters'!$J$5,'User Parameters'!$J$5,IF(T38>'User Parameters'!$J$6,'User Parameters'!$J$6,T38))","v":0.63000392539810679},0,0,{"$f":"(B38-C38-F38-E38-S38-V38)/'Results Dashboard'!$D$42","v":0.28199568206208253},{"$f":"IF((X38+W38)>0,(X38+W38)*0.5*((1+'User Parameters'!C$48)^((12+UP_COC_WithholdLag)/12)-1),(X38+W38)*0.5*((1+'User Parameters'!$C$49)^((12+UP_COC_WithholdLag)/12)-1))","v":0},{"$f":"-'User Parameters'!$C$12*('User Parameters'!$C$13-1)","v":0},0.28199568206208253,0.9999999999999839,3.5194069880617462E-14,3.5194069880617462E-14,{"$f":"IF($AA38<-'Results Dashboard'!$J$7,$AA38+'Results Dashboard'!$J$7,0)","v":0},{"$f":"IF($AA38<-'Results Dashboard'!$J$8,$AA38+'Results Dashboard'!$J$8,0)","v":0},{"$f":"IF($AA38<-'Results Dashboard'!$J$9,$AA38+'Results Dashboard'!$J$9,0)","v":0},{"$f":"IF($AA38<-'Results Dashboard'!$J$11,$AA38+'Results Dashboard'!$J$11,0)","v":0},{"$f":"IF($AA38<-'Results Dashboard'!$J$10,$AA38+'Results Dashboard'!$J$10,0)","v":0},null,{"$f":"IF((X38+W38)>0,(X38+W38)*0.5*'User Parameters'!C$48,(X38+W38)*0.5*'User Parameters'!$C$49)","v":0},{"$f":"-'User Parameters'!$C$12*('User Parameters'!$C$13-1)","v":0},0.28199568206208253]
[0.63500392539810679,454.54342697283204,288.63686039165606,0.63500392539810679,{"$f":"'User Parameters'!$C$10","v":40},{"$f":"B39*'User Parameters'!$C$14","v":0},125.90656658117598,0.27699568206208247,0.63500392539810679,{"$f":"IF(UP_RSBasis=\"MLR\",UP_RSTarget_MLR,IF(UP_RSBasis=\"Medical Baseline\",UP_RSTarget_Medlcal,0))","v":0},0,0,0,0,0,0,0,"",0,{"$f":"(S39+C39+'User Parameters'!$C$11)/(B39-F39)","v":0.63500392539810679},{"$f":"IF(T39<'User Parameters'!$J$5,'User Parameters'!$J$5,IF(T39>'User Parameters'!$J$6,'User Parameters'!$J$6,T39))","v":0.63500392539810679},0,0,{"$f":"(B39-C39-F39-E39-S39-V39)/'Results Dashboard'!$D$42","v":0.27699568206208247},{"$f":"IF((X39+W39)>0,(X39+W39)*0.5*((1+'User Parameters'!C$48)^((12+UP_COC_WithholdLag)/12)-1),(X39+W39)*0.5*((1+'User Parameters'!$C$49)^((12+UP_COC_WithholdLag)/12)-1))","v":0},{"$f":"-'User Parameters'!$C$12*('User Parameters'!$C$13-1)","v":0},0.27699568206208247,0.99999999999994871,1.0857981180834031E-13,1.0857981180834031E-13,{"$f":"IF($AA39<-'Results Dashboard'!$J$7,$AA39+'Results Dashboard'!$J$7,0)","v":0},{"$f":"IF($AA39<-'Results Dashboard'!$J$8,$AA39+'Results Dashboard'!$J$8,0)","v":0},{"$f":"IF($AA39<-'Results Dashboard'!$J$9,$AA39+'Results Dashboard'!$J$9,0)","v":0},{"$f":"IF($AA39<-'Results Dashboard'!$J$11,$AA39+'Results Dashboard'!$J$11,0)","v":0},{"$f":"IF($AA39<-'Results Dashboard'!$J$10,$AA39+'Results Dashboard'!$J$10,0)","v":0},null,{"$f":"IF((X39+W39)>0,(X39+W39)*0.5*'User Parameters'!C$48,(X39+W39)*0.5*'User Parameters'!$C$49)","v":0},{"$f":"-'User Parameters'!$C$12*('User Parameters'!$C$13-1)","v":0},0.27699568206208247]
[0.6400039253981068,454.54342697283204,290.9095775265202,0.6400039253981068,{"$f":"'User Parameters'!$C$10","v":40},{"$f":"B40*'User Parameters'!$C$14","v":0},123.63384944631184,0.27199568206208252,0.6400039253981068,{"$f":"IF(UP_RSBasis=\"MLR\",UP_RSTarget_MLR,IF(UP_RSBasis=\"Medical Baseline\",UP_RSTarget_Medlcal,0))","v":0},{"$f":"IF(UP_RSBasis=\"MLR\",J40-I40,IF(UP_RSBasis=\"Medical Baseline\",J40-$C40,0))","v":0},0,0,0,0,0,0,{"$f":"IF(UP_RSBasis=\"MLR\",SUMPRODUCT(L$4:Q$4,L40:Q40),\"\")","v":""},{"$f":"IF(UP_RSBasis=\"MLR\",R40*(B40-F40),SUMPRODUCT($L$4:$Q$4,$L40:$Q40))","v":0},{"$f":"(S40+C40+'User Parameters'!$C$11)/(B40-F40)","v":0.6400039253981068},{"$f":"IF(T40<'User Parameters'!$J$5,'User Parameters'!$J$5,IF(T40>'User Parameters'!$J$6,'User Parameters'!$J$6,T40))","v":0.6400039253981068},{"$f":"(U40-T40)*(B40-F40)","v":0},{"$f":"V40/B40","v":0},{"$f":"(B40-C40-F40-E40-S40-V40)/'Results Dashboard'!$D$42","v":0.27199568206208252},{"$f":"IF((X40+W40)>0,(X40+W40)*0.5*((1+'User Parameters'!C$48)^((12+UP_COC_WithholdLag)/12)-1),(X40+W40)*0.5*((1+'User Parameters'!$C$49)^((12+UP_COC_WithholdLag)/12)-1))","v":0},{"$f":"-'User Parameters'!$C$12*('User Parameters'!$C$13-1)","v":0},0.27199568206208252,{"$f":"_xlfn.NORM.DIST(H40,$AD$2,$AD$3,TRUE)","v":0.99999999999984013},3.276268145668837E-13,3.276268145668837E-13,{"$f":"IF($AA40<-'Results Dashboard'!$J$7,$AA40+'Results Dashboard'!$J$7,0)","v":0},{"$f":"IF($AA40<-'Results Dashboard'!$J$8,$AA40+'Results Dashboard'!$J$8,0)","v":0},{"$f":"IF($AA40<-'Results Dashboard'!$J$9,$AA40+'Results Dashboard'!$J$9,0)","v":0},{"$f":"IF($AA40<-'Results Dashboard'!$J$11,$AA40+'Results Dashboard'!$J$11,0)","v":0},{"$f":"IF($AA40<-'Results Dashboard'!$J$10,$AA40+'Results Dashboard'!$J$10,0)","v":0},null,{"$f":"IF((X40+W40)>0,(X40+W40)*0.5*'User Parameters'!C$48,(X40+W40)*0.5*'User Parameters'!$C$49)","v":0},{"$f":"-'User Parameters'!$C$12*('User Parameters'!$C$13-1)","v":0},0.27199568206208252]
[0.6450039253981068,454.54342697283204,293.18229466138439,0.64500392539810691,{"$f":"'User Parameters'!$C$10","v":40},{"$f":"B41*'User Parameters'!$C$14","v":0},121.36113231144765,0.26699568206208241,0.64500392539810691,{"$f":"IF(UP_RSBasis=\"MLR\",UP_RSTarget_MLR,IF(UP_RSBasis=\"Medical Baseline\",UP_RSTarget_Medlcal,0))","v":0},0,0,0,0,0,0,0,"",0,{"$f":"(S41+C41+'User Parameters'!$C$11)/(B41-F41)","v":0.64500392539810691},{"$f":"IF(T41<'User Parameters'!$J$5,'User Parameters'!$J$5,IF(T41>'User Parameters'!$J$6,'User Parameters'!$J$6,T41))","v":0.64500392539810691},0,0,{"$f":"(B41-C41-F41-E41-S41-V41)/'Results Dashboard'!$D$42","v":0.26699568206208241},{"$f":"IF((X41+W41)>0,(X41+W41)*0.5*((1+'User Parameters'!C$48)^((12+UP_COC_WithholdLag)/12)-1),(X41+W41)*0.5*((1+'User Parameters'!$C$49)^((12+UP_COC_WithholdLag)/12)-1))","v":0},{"$f":"-'User Parameters'!$C$12*('User Parameters'!$C$13-1)","v":0},0.26699568206208241,0.9999999999995125,9.6533891991157361E-13,9.6533891991157361E-13,{"$f":"IF($AA41<-'Results Dashboard'!$J$7,$AA41+'Results Dashboard'!$J$7,0)","v":0},{"$f":"IF($AA41<-'Results Dashboard'!$J$8,$AA41+'Results Dashboard'!$J$8,0)","v":0},{"$f":"IF($AA41<-'Results Dashboard'!$J$9,$AA41+'Results Dashboard'!$J$9,0)","v":0},{"$f":"IF($AA41<-'Results Dashboard'!$J$11,$AA41+'Results Dashboard'!$J$11,0)","v":0},{"$f":"IF($AA41<-'Results Dashboard'!$J$10,$AA41+'Results Dashboard'!$J$10,0)","v":0},null,{"$f":"IF((X41+W41)>0,(X41+W41)*0.5*'User Parameters'!C$48,(X41+W41)*0.5*'User Parameters'!$C$49)","v":0},{"$f":"-'User Parameters'!$C$12*('User Parameters'!$C$13-1)","v":0},0.26699568206208241]
[0.65000392539810681,454.54342697283204,295.45501179624853,0.65000392539810681,{"$f":"'User Parameters'!$C$10","v":40},{"$f":"B42*'User Parameters'!$C$14","v":0},119.08841517658351,0.26199568206208246,0.65000392539810681,{"$f":"IF(UP_RSBasis=\"MLR\",UP_RSTarget_MLR,IF(UP_RSBasis=\"Medical Baseline\",UP_RSTarget_Medlcal,0))","v":0},0,0,0,0,0,0,0,"",0,{"$f":"(S42+C42+'User Parameters'!$C$11)/(B42-F42)","v":0.65000392539810681},{"$f":"IF(T42<'User Parameters'!$J$5,'User Parameters'!$J$5,IF(T42>'User Parameters'!$J$6,'User Parameters'!$J$6,T42))","v":0.65000392539810681},0,0,{"$f":"(B42-C42-F42-E42-S42-V42)/'Results Dashboard'!$D$42","v":0.26199568206208246},{"$f":"IF((X42+W42)>0,(X42+W42)*0.5*((1+'User Parameters'!C$48)^((12+UP_COC_WithholdLag)/12)-1),(X42+W42)*0.5*((1+'User Parameters'!$C$49)^((12+UP_COC_WithholdLag)/12)-1))","v":0},{"$f":"-'User Parameters'!$C$12*('User Parameters'!$C$13-1)","v":0},0.26199568206208246,0.99999999999854716,2.780442542871242E-12,2.780442542871242E-12,{"$f":"IF($AA42<-'Results Dashboard'!$J$7,$AA42+'Results Dashboard'!$J$7,0)","v":0},{"$f":"IF($AA42<-'Results Dashboard'!$J$8,$AA42+'Results Dashboard'!$J$8,0)","v":0},{"$f":"IF($AA42<-'Results Dashboard'!$J$9,$AA42+'Results Dashboard'!$J$9,0)","v":0},{"$f":"IF($AA42<-'Results Dashboard'!$J$11,$AA42+'Results Dashboard'!$J$11,0)","v":0},{"$f":"IF($AA42<-'Results Dashboard'!$J$10,$AA42+'Results Dashboard'!$J$10,0)","v":0},null,{"$f":"IF((X42+W42)>0,(X42+W42)*0.5*'User Parameters'!C$48,(X42+W42)*0.5*'User Parameters'!$C$49)","v":0},{"$f":"-'User Parameters'!$C$12*('User Parameters'!$C$13-1)","v":0},0.26199568206208246]
[0.65500392539810681,454.54342697283204,297.72772893111267,0.65500392539810681,{"$f":"'User Parameters'!$C$10","v":40},{"$f":"B43*'User Parameters'!$C$14","v":0},116.81569804171937,0.25699568206208251,0.65500392539810681,{"$f":"IF(UP_RSBasis=\"MLR\",UP_RSTarget_MLR,IF(UP_RSBasis=\"Medical Baseline\",UP_RSTarget_Medlcal,0))","v":0},0,0,0,0,0,0,0,"",0,{"$f":"(S43+C43+'User Parameters'!$C$11)/(B43-F43)","v":0.65500392539810681},{"$f":"IF(T43<'User Parameters'!$J$5,'User Parameters'!$J$5,IF(T43>'User Parameters'!$J$6,'User Parameters'!$J$6,T43))","v":0.65500392539810681},0,0,{"$f":"(B43-C43-F43-E43-S43-V43)/'Results Dashboard'!$D$42","v":0.25699568206208251},{"$f":"IF((X43+W43)>0,(X43+W43)*0.5*((1+'User Parameters'!C$48)^((12+UP_COC_WithholdLag)/12)-1),(X43+W43)*0.5*((1+'User Parameters'!$C$49)^((12+UP_COC_WithholdLag)/12)-1))","v":0},{"$f":"-'User Parameters'!$C$12*('User Parameters'!$C$13-1)","v":0},0.25699568206208251,0.99999999999576672,7.8258510782802659E-12,7.8258510782802659E-12,{"$f":"IF($AA43<-'Results Dashboard'!$J$7,$AA43+'Results Dashboard'!$J$7,0)","v":0},{"$f":"IF($AA43<-'Results Dashboard'!$J$8,$AA43+'Results Dashboard'!$J$8,0)","v":0},{"$f":"IF($AA43<-'Results Dashboard'!$J$9,$AA43+'Results Dashboard'!$J$9,0)","v":0},{"$f":"IF($AA43<-'Results Dashboard'!$J$11,$AA43+'Results Dashboard'!$J$11,0)","v":0},{"$f":"IF($AA43<-'Results Dashboard'!$J$10,$AA43+'Results Dashboard'!$J$10,0)","v":0},null,{"$f":"IF((X43+W43)>0,(X43+W43)*0.5*'User Parameters'!C$48,(X43+W43)*0.5*'User Parameters'!$C$49)","v":0},{"$f":"-'User Parameters'!$C$12*('User Parameters'!$C$13-1)","v":0},0.25699568206208251]
[0.66000392539810682,454.54342697283204,300.00044606597686,0.66000392539810682,{"$f":"'User Parameters'!$C$10","v":40},{"$f":"B44*'User Parameters'!$C$14","v":0},114.54298090685518,0.25199568206208245,0.66000392539810682,{"$f":"IF(UP_RSBasis=\"MLR\",UP_RSTarget_MLR,IF(UP_RSBasis=\"Medical Baseline\",UP_RSTarget_Medlcal,0))","v":0},0,0,0,0,0,0,0,"",0,{"$f":"(S44+C44+'User Parameters'!$C$11)/(B44-F44)","v":0.66000392539810682},{"$f":"IF(T44<'User Parameters'!$J$5,'User Parameters'!$J$5,IF(T44>'User Parameters'!$J$6,'User Parameters'!$J$6,T44))","v":0.66000392539810682},0,0,{"$f":"(B44-C44-F44-E44-S44-V44)/'Results Dashboard'!$D$42","v":0.25199568206208245},{"$f":"IF((X44+W44)>0,(X44+W44)*0.5*((1+'User Parameters'!C$48)^((12+UP_COC_WithholdLag)/12)-1),(X44+W44)*0.5*((1+'User Parameters'!$C$49)^((12+UP_COC_WithholdLag)/12)-1))","v":0},{"$f":"-'User Parameters'!$C$12*('User Parameters'!$C$13-1)","v":0},0.25199568206208245,0.99999999998794087,2.1525448090642385E-11,2.1525448090642385E-11,{"$f":"IF($AA44<-'Results Dashboard'!$J$7,$AA44+'Results Dashboard'!$J$7,0)","v":0},{"$f":"IF($AA44<-'Results Dashboard'!$J$8,$AA44+'Results Dashboard'!$J$8,0)","v":0},{"$f":"IF($AA44<-'Results Dashboard'!$J$9,$AA44+'Results Dashboard'!$J$9,0)","v":0},{"$f":"IF($AA44<-'Results Dashboard'!$J$11,$AA44+'Results Dashboard'!$J$11,0)","v":0},{"$f":"IF($AA44<-'Results Dashboard'!$J$10,$AA44+'Results Dashboard'!$J$10,0)","v":0},null,{"$f":"IF((X44+W44)>0,(X44+W44)*0.5*'User Parameters'!C$48,(X44+W44)*0.5*'User Parameters'!$C$49)","v":0},{"$f":"-'User Parameters'!$C$12*('User Parameters'!$C$13-1)","v":0},0.25199568206208245]
[0.66500392539810682,454.54342697283204,302.273163200841,0.66500392539810682,{"$f":"'User Parameters'!$C$10","v":40},{"$f":"B45*'User Parameters'!$C$14","v":0},112.27026377199104,0.2469956820620825,0.66500392539810682,{"$f":"IF(UP_RSBasis=\"MLR\",UP_RSTarget_MLR,IF(UP_RSBasis=\"Medical Baseline\",UP_RSTarget_Medlcal,0))","v":0},0,0,0,0,0,0,0,"",0,{"$f":"(S45+C45+'User Parameters'!$C$11)/(B45-F45)","v":0.66500392539810682},{"$f":"IF(T45<'User Parameters'!$J$5,'User Parameters'!$J$5,IF(T45>'User Parameters'!$J$6,'User Parameters'!$J$6,T45))","v":0.66500392539810682},0,0,{"$f":"(B45-C45-F45-E45-S45-V45)/'Results Dashboard'!$D$42","v":0.2469956820620825},{"$f":"IF((X45+W45)>0,(X45+W45)*0.5*((1+'User Parameters'!C$48)^((12+UP_COC_WithholdLag)/12)-1),(X45+W45)*0.5*((1+'User Parameters'!$C$49)^((12+UP_COC_WithholdLag)/12)-1))","v":0},{"$f":"-'User Parameters'!$C$12*('User Parameters'!$C$13-1)","v":0},0.2469956820620825,0.99999999996641542,5.7861937463599133E-11,5.7861937463599133E-11,{"$f":"IF($AA45<-'Results Dashboard'!$J$7,$AA45+'Results Dashboard'!$J$7,0)","v":0},{"$f":"IF($AA45<-'Results Dashboard'!$J$8,$AA45+'Results Dashboard'!$J$8,0)","v":0},{"$f":"IF($AA45<-'Results Dashboard'!$J$9,$AA45+'Results Dashboard'!$J$9,0)","v":0},{"$f":"IF($AA45<-'Results Dashboard'!$J$11,$AA45+'Results Dashboard'!$J$11,0)","v":0},{"$f":"IF($AA45<-'Results Dashboard'!$J$10,$AA45+'Results Dashboard'!$J$10,0)","v":0},null,{"$f":"IF((X45+W45)>0,(X45+W45)*0.5*'User Parameters'!C$48,(X45+W45)*0.5*'User Parameters'!$C$49)","v":0},{"$f":"-'User Parameters'!$C$12*('User Parameters'!$C$13-1)","v":0},0.2469956820620825]
[0.67000392539810683,454.54342697283204,304.54588033570519,0.67000392539810683,{"$f":"'User Parameters'!$C$10","v":40},{"$f":"B46*'User Parameters'!$C$14","v":0},109.99754663712685,0.24199568206208244,0.67000392539810683,{"$f":"IF(UP_RSBasis=\"MLR\",UP_RSTarget_MLR,IF(UP_RSBasis=\"Medical Baseline\",UP_RSTarget_Medlcal,0))","v":0},0,0,0,0,0,0,0,"",0,{"$f":"(S46+C46+'User Parameters'!$C$11)/(B46-F46)","v":0.67000392539810683},{"$f":"IF(T46<'User Parameters'!$J$5,'User Parameters'!$J$5,IF(T46>'User Parameters'!$J$6,'User Parameters'!$J$6,T46))","v":0.67000392539810683},0,0,{"$f":"(B46-C46-F46-E46-S46-V46)/'Results Dashboard'!$D$42","v":0.24199568206208244},{"$f":"IF((X46+W46)>0,(X46+W46)*0.5*((1+'User Parameters'!C$48)^((12+UP_COC_WithholdLag)/12)-1),(X46+W46)*0.5*((1+'User Parameters'!$C$49)^((12+UP_COC_WithholdLag)/12)-1))","v":0},{"$f":"-'User Parameters'!$C$12*('User Parameters'!$C$13-1)","v":0},0.24199568206208244,0.99999999990855348,1.5200041225682526E-10,1.5200041225682526E-10,{"$f":"IF($AA46<-'Results Dashboard'!$J$7,$AA46+'Results Dashboard'!$J$7,0)","v":0},{"$f":"IF($AA46<-'Results Dashboard'!$J$8,$AA46+'Results Dashboard'!$J$8,0)","v":0},{"$f":"IF($AA46<-'Results Dashboard'!$J$9,$AA46+'Results Dashboard'!$J$9,0)","v":0},{"$f":"IF($AA46<-'Results Dashboard'!$J$11,$AA46+'Results Dashboard'!$J$11,0)","v":0},{"$f":"IF($AA46<-'Results Dashboard'!$J$10,$AA46+'Results Dashboard'!$J$10,0)","v":0},null,{"$f":"IF((X46+W46)>0,(X46+W46)*0.5*'User Parameters'!C$48,(X46+W46)*0.5*'User Parameters'!$C$49)","v":0},{"$f":"-'User Parameters'!$C$12*('User Parameters'!$C$13-1)","v":0},0.24199568206208244]
[0.67500392539810683,454.54342697283204,306.81859747056933,0.67500392539810683,{"$f":"'User Parameters'!$C$10","v":40},{"$f":"B47*'User Parameters'!$C$14","v":0},107.72482950226271,0.23699568206208249,0.67500392539810683,{"$f":"IF(UP_RSBasis=\"MLR\",UP_RSTarget_MLR,IF(UP_RSBasis=\"Medical Baseline\",UP_RSTarget_Medlcal,0))","v":0},0,0,0,0,0,0,0,"",0,{"$f":"(S47+C47+'User Parameters'!$C$11)/(B47-F47)","v":0.67500392539810683},{"$f":"IF(T47<'User Parameters'!$J$5,'User Parameters'!$J$5,IF(T47>'User Parameters'!$J$6,'User Parameters'!$J$6,T47))","v":0.67500392539810683},0,0,{"$f":"(B47-C47-F47-E47-S47-V47)/'Results Dashboard'!$D$42","v":0.23699568206208249},{"$f":"IF((X47+W47)>0,(X47+W47)*0.5*((1+'User Parameters'!C$48)^((12+UP_COC_WithholdLag)/12)-1),(X47+W47)*0.5*((1+'User Parameters'!$C$49)^((12+UP_COC_WithholdLag)/12)-1))","v":0},{"$f":"-'User Parameters'!$C$12*('User Parameters'!$C$13-1)","v":0},0.23699568206208249,0.99999999975655307,3.9021974540531801E-10,3.9021974540531801E-10,{"$f":"IF($AA47<-'Results Dashboard'!$J$7,$AA47+'Results Dashboard'!$J$7,0)","v":0},{"$f":"IF($AA47<-'Results Dashboard'!$J$8,$AA47+'Results Dashboard'!$J$8,0)","v":0},{"$f":"IF($AA47<-'Results Dashboard'!$J$9,$AA47+'Results Dashboard'!$J$9,0)","v":0},{"$f":"IF($AA47<-'Results Dashboard'!$J$11,$AA47+'Results Dashboard'!$J$11,0)","v":0},{"$f":"IF($AA47<-'Results Dashboard'!$J$10,$AA47+'Results Dashboard'!$J$10,0)","v":0},null,{"$f":"IF((X47+W47)>0,(X47+W47)*0.5*'User Parameters'!C$48,(X47+W47)*0.5*'User Parameters'!$C$49)","v":0},{"$f":"-'User Parameters'!$C$12*('User Parameters'!$C$13-1)","v":0},0.23699568206208249]
[0.68000392539810683,454.54342697283204,309.09131460543352,0.68000392539810695,{"$f":"'User Parameters'!$C$10","v":40},{"$f":"B48*'User Parameters'!$C$14","v":0},105.45211236739851,0.2319956820620824,0.68000392539810695,{"$f":"IF(UP_RSBasis=\"MLR\",UP_RSTarget_MLR,IF(UP_RSBasis=\"Medical Baseline\",UP_RSTarget_Medlcal,0))","v":0},0,0,0,0,0,0,0,"",0,{"$f":"(S48+C48+'User Parameters'!$C$11)/(B48-F48)","v":0.68000392539810695},{"$f":"IF(T48<'User Parameters'!$J$5,'User Parameters'!$J$5,IF(T48>'User Parameters'!$J$6,'User Parameters'!$J$6,T48))","v":0.68000392539810695},0,0,{"$f":"(B48-C48-F48-E48-S48-V48)/'Results Dashboard'!$D$42","v":0.2319956820620824},{"$f":"IF((X48+W48)>0,(X48+W48)*0.5*((1+'User Parameters'!C$48)^((12+UP_COC_WithholdLag)/12)-1),(X48+W48)*0.5*((1+'User Parameters'!$C$49)^((12+UP_COC_WithholdLag)/12)-1))","v":0},{"$f":"-'User Parameters'!$C$12*('User Parameters'!$C$13-1)","v":0},0.2319956820620824,0.99999999936633333,9.7900754170154869E-10,9.7900754170154869E-10,{"$f":"IF($AA48<-'Results Dashboard'!$J$7,$AA48+'Results Dashboard'!$J$7,0)","v":0},{"$f":"IF($AA48<-'Results Dashboard'!$J$8,$AA48+'Results Dashboard'!$J$8,0)","v":0},{"$f":"IF($AA48<-'Results Dashboard'!$J$9,$AA48+'Results Dashboard'!$J$9,0)","v":0},{"$f":"IF($AA48<-'Results Dashboard'!$J$11,$AA48+'Results Dashboard'!$J$11,0)","v":0},{"$f":"IF($AA48<-'Results Dashboard'!$J$10,$AA48+'Results Dashboard'!$J$10,0)","v":0},null,{"$f":"IF((X48+W48)>0,(X48+W48)*0.5*'User Parameters'!C$48,(X48+W48)*0.5*'User Parameters'!$C$49)","v":0},{"$f":"-'User Parameters'!$C$12*('User Parameters'!$C$13-1)","v":0},0.2319956820620824]
[0.68500392539810684,454.54342697283204,311.36403174029766,0.68500392539810684,{"$f":"'User Parameters'!$C$10","v":40},{"$f":"B49*'User Parameters'!$C$14","v":0},103.17939523253438,0.22699568206208245,0.68500392539810684,{"$f":"IF(UP_RSBasis=\"MLR\",UP_RSTarget_MLR,IF(UP_RSBasis=\"Medical Baseline\",UP_RSTarget_Medlcal,0))","v":0},0,0,0,0,0,0,0,"",0,{"$f":"(S49+C49+'User Parameters'!$C$11)/(B49-F49)","v":0.68500392539810684},{"$f":"IF(T49<'User Parameters'!$J$5,'User Parameters'!$J$5,IF(T49>'User Parameters'!$J$6,'User Parameters'!$J$6,T49))","v":0.68500392539810684},0,0,{"$f":"(B49-C49-F49-E49-S49-V49)/'Results Dashboard'!$D$42","v":0.22699568206208245},{"$f":"IF((X49+W49)>0,(X49+W49)*0.5*((1+'User Parameters'!C$48)^((12+UP_COC_WithholdLag)/12)-1),(X49+W49)*0.5*((1+'User Parameters'!$C$49)^((12+UP_COC_WithholdLag)/12)-1))","v":0},{"$f":"-'User Parameters'!$C$12*('User Parameters'!$C$13-1)","v":0},0.22699568206208245,0.99999999838732578,2.4003552479001655E-9,2.4003552479001655E-9,{"$f":"IF($AA49<-'Results Dashboard'!$J$7,$AA49+'Results Dashboard'!$J$7,0)","v":0},{"$f":"IF($AA49<-'Results Dashboard'!$J$8,$AA49+'Results Dashboard'!$J$8,0)","v":0},{"$f":"IF($AA49<-'Results Dashboard'!$J$9,$AA49+'Results Dashboard'!$J$9,0)","v":0},{"$f":"IF($AA49<-'Results Dashboard'!$J$11,$AA49+'Results Dashboard'!$J$11,0)","v":0},{"$f":"IF($AA49<-'Results Dashboard'!$J$10,$AA49+'Results Dashboard'!$J$10,0)","v":0},null,{"$f":"IF((X49+W49)>0,(X49+W49)*0.5*'User Parameters'!C$48,(X49+W49)*0.5*'User Parameters'!$C$49)","v":0},{"$f":"-'User Parameters'!$C$12*('User Parameters'!$C$13-1)","v":0},0.22699568206208245]
[0.69000392539810684,454.54342697283204,313.6367488751618,0.69000392539810684,{"$f":"'User Parameters'!$C$10","v":40},{"$f":"B50*'User Parameters'!$C$14","v":0},100.90667809767024,0.22199568206208251,0.69000392539810684,{"$f":"IF(UP_RSBasis=\"MLR\",UP_RSTarget_MLR,IF(UP_RSBasis=\"Medical Baseline\",UP_RSTarget_Medlcal,0))","v":0},0,0,0,0,0,0,0,"",0,{"$f":"(S50+C50+'User Parameters'!$C$11)/(B50-F50)","v":0.69000392539810684},{"$f":"IF(T50<'User Parameters'!$J$5,'User Parameters'!$J$5,IF(T50>'User Parameters'!$J$6,'User Parameters'!$J$6,T50))","v":0.69000392539810684},0,0,{"$f":"(B50-C50-F50-E50-S50-V50)/'Results Dashboard'!$D$42","v":0.22199568206208251},{"$f":"IF((X50+W50)>0,(X50+W50)*0.5*((1+'User Parameters'!C$48)^((12+UP_COC_WithholdLag)/12)-1),(X50+W50)*0.5*((1+'User Parameters'!$C$49)^((12+UP_COC_WithholdLag)/12)-1))","v":0},{"$f":"-'User Parameters'!$C$12*('User Parameters'!$C$13-1)","v":0},0.22199568206208251,0.99999999598697054,5.7514532025848553E-9,5.7514532025848553E-9,{"$f":"IF($AA50<-'Results Dashboard'!$J$7,$AA50+'Results Dashboard'!$J$7,0)","v":0},{"$f":"IF($AA50<-'Results Dashboard'!$J$8,$AA50+'Results Dashboard'!$J$8,0)","v":0},{"$f":"IF($AA50<-'Results Dashboard'!$J$9,$AA50+'Results Dashboard'!$J$9,0)","v":0},{"$f":"IF($AA50<-'Results Dashboard'!$J$11,$AA50+'Results Dashboard'!$J$11,0)","v":0},{"$f":"IF($AA50<-'Results Dashboard'!$J$10,$AA50+'Results Dashboard'!$J$10,0)","v":0},null,{"$f":"IF((X50+W50)>0,(X50+W50)*0.5*'User Parameters'!C$48,(X50+W50)*0.5*'User Parameters'!$C$49)","v":0},{"$f":"-'User Parameters'!$C$12*('User Parameters'!$C$13-1)","v":0},0.22199568206208251]
[0.69500392539810685,454.54342697283204,315.90946601002599,0.69500392539810685,{"$f":"'User Parameters'!$C$10","v":40},{"$f":"B51*'User Parameters'!$C$14","v":0},98.633960962806043,0.21699568206208242,0.69500392539810685,{"$f":"IF(UP_RSBasis=\"MLR\",UP_RSTarget_MLR,IF(UP_RSBasis=\"Medical Baseline\",UP_RSTarget_Medlcal,0))","v":0},0,0,0,0,0,0,0,"",0,{"$f":"(S51+C51+'User Parameters'!$C$11)/(B51-F51)","v":0.69500392539810685},{"$f":"IF(T51<'User Parameters'!$J$5,'User Parameters'!$J$5,IF(T51>'User Parameters'!$J$6,'User Parameters'!$J$6,T51))","v":0.69500392539810685},0,0,{"$f":"(B51-C51-F51-E51-S51-V51)/'Results Dashboard'!$D$42","v":0.21699568206208242},{"$f":"IF((X51+W51)>0,(X51+W51)*0.5*((1+'User Parameters'!C$48)^((12+UP_COC_WithholdLag)/12)-1),(X51+W51)*0.5*((1+'User Parameters'!$C$49)^((12+UP_COC_WithholdLag)/12)-1))","v":0},{"$f":"-'User Parameters'!$C$12*('User Parameters'!$C$13-1)","v":0},0.21699568206208242,0.99999999023551733,1.3467665760380498E-8,1.3467665760380498E-8,{"$f":"IF($AA51<-'Results Dashboard'!$J$7,$AA51+'Results Dashboard'!$J$7,0)","v":0},{"$f":"IF($AA51<-'Results Dashboard'!$J$8,$AA51+'Results Dashboard'!$J$8,0)","v":0},{"$f":"IF($AA51<-'Results Dashboard'!$J$9,$AA51+'Results Dashboard'!$J$9,0)","v":0},{"$f":"IF($AA51<-'Results Dashboard'!$J$11,$AA51+'Results Dashboard'!$J$11,0)","v":0},{"$f":"IF($AA51<-'Results Dashboard'!$J$10,$AA51+'Results Dashboard'!$J$10,0)","v":0},null,{"$f":"IF((X51+W51)>0,(X51+W51)*0.5*'User Parameters'!C$48,(X51+W51)*0.5*'User Parameters'!$C$49)","v":0},{"$f":"-'User Parameters'!$C$12*('User Parameters'!$C$13-1)","v":0},0.21699568206208242]
[0.70000392539810685,454.54342697283204,318.18218314489013,0.70000392539810685,{"$f":"'User Parameters'!$C$10","v":40},{"$f":"B52*'User Parameters'!$C$14","v":0},96.361243827941905,0.21199568206208247,0.70000392539810685,{"$f":"IF(UP_RSBasis=\"MLR\",UP_RSTarget_MLR,IF(UP_RSBasis=\"Medical Baseline\",UP_RSTarget_Medlcal,0))","v":0},0,0,0,0,0,0,0,"",0,{"$f":"(S52+C52+'User Parameters'!$C$11)/(B52-F52)","v":0.70000392539810685},{"$f":"IF(T52<'User Parameters'!$J$5,'User Parameters'!$J$5,IF(T52>'User Parameters'!$J$6,'User Parameters'!$J$6,T52))","v":0.70000392539810685},0,0,{"$f":"(B52-C52-F52-E52-S52-V52)/'Results Dashboard'!$D$42","v":0.21199568206208247},{"$f":"IF((X52+W52)>0,(X52+W52)*0.5*((1+'User Parameters'!C$48)^((12+UP_COC_WithholdLag)/12)-1),(X52+W52)*0.5*((1+'User Parameters'!$C$49)^((12+UP_COC_WithholdLag)/12)-1))","v":0},{"$f":"-'User Parameters'!$C$12*('User Parameters'!$C$13-1)","v":0},0.21199568206208247,0.99999997676785157,3.0819085283795289E-8,3.0819085283795289E-8,{"$f":"IF($AA52<-'Results Dashboard'!$J$7,$AA52+'Results Dashboard'!$J$7,0)","v":0},{"$f":"IF($AA52<-'Results Dashboard'!$J$8,$AA52+'Results Dashboard'!$J$8,0)","v":0},{"$f":"IF($AA52<-'Results Dashboard'!$J$9,$AA52+'Results Dashboard'!$J$9,0)","v":0},{"$f":"IF($AA52<-'Results Dashboard'!$J$11,$AA52+'Results Dashboard'!$J$11,0)","v":0},{"$f":"IF($AA52<-'Results Dashboard'!$J$10,$AA52+'Results Dashboard'!$J$10,0)","v":0},null,{"$f":"IF((X52+W52)>0,(X52+W52)*0.5*'User Parameters'!C$48,(X52+W52)*0.5*'User Parameters'!$C$49)","v":0},{"$f":"-'User Parameters'!$C$12*('User Parameters'!$C$13-1)","v":0},0.21199568206208247]
[0.70500392539810686,454.54342697283204,320.45490027975433,0.70500392539810686,{"$f":"'User Parameters'!$C$10","v":40},{"$f":"B53*'User Parameters'!$C$14","v":0},94.088526693077711,0.20699568206208241,0.70500392539810686,{"$f":"IF(UP_RSBasis=\"MLR\",UP_RSTarget_MLR,IF(UP_RSBasis=\"Medical Baseline\",UP_RSTarget_Medlcal,0))","v":0},0,0,0,0,0,0,0,"",0,{"$f":"(S53+C53+'User Parameters'!$C$11)/(B53-F53)","v":0.70500392539810686},{"$f":"IF(T53<'User Parameters'!$J$5,'User Parameters'!$J$5,IF(T53>'User Parameters'!$J$6,'User Parameters'!$J$6,T53))","v":0.70500392539810686},0,0,{"$f":"(B53-C53-F53-E53-S53-V53)/'Results Dashboard'!$D$42","v":0.20699568206208241},{"$f":"IF((X53+W53)>0,(X53+W53)*0.5*((1+'User Parameters'!C$48)^((12+UP_COC_WithholdLag)/12)-1),(X53+W53)*0.5*((1+'User Parameters'!$C$49)^((12+UP_COC_WithholdLag)/12)-1))","v":0},{"$f":"-'User Parameters'!$C$12*('User Parameters'!$C$13-1)","v":0},0.20699568206208241,0.99999994594876629,6.8922318297026663E-8,6.8922318297026663E-8,{"$f":"IF($AA53<-'Results Dashboard'!$J$7,$AA53+'Results Dashboard'!$J$7,0)","v":0},{"$f":"IF($AA53<-'Results Dashboard'!$J$8,$AA53+'Results Dashboard'!$J$8,0)","v":0},{"$f":"IF($AA53<-'Results Dashboard'!$J$9,$AA53+'Results Dashboard'!$J$9,0)","v":0},{"$f":"IF($AA53<-'Results Dashboard'!$J$11,$AA53+'Results Dashboard'!$J$11,0)","v":0},{"$f":"IF($AA53<-'Results Dashboard'!$J$10,$AA53+'Results Dashboard'!$J$10,0)","v":0},null,{"$f":"IF((X53+W53)>0,(X53+W53)*0.5*'User Parameters'!C$48,(X53+W53)*0.5*'User Parameters'!$C$49)","v":0},{"$f":"-'User Parameters'!$C$12*('User Parameters'!$C$13-1)","v":0},0.20699568206208241]
[0.71000392539810686,454.54342697283204,322.72761741461846,0.71000392539810686,{"$f":"'User Parameters'!$C$10","v":40},{"$f":"B54*'User Parameters'!$C$14","v":0},91.815809558213573,0.20199568206208246,0.71000392539810686,{"$f":"IF(UP_RSBasis=\"MLR\",UP_RSTarget_MLR,IF(UP_RSBasis=\"Medical Baseline\",UP_RSTarget_Medlcal,0))","v":0},0,0,0,0,0,0,0,"",0,{"$f":"(S54+C54+'User Parameters'!$C$11)/(B54-F54)","v":0.71000392539810686},{"$f":"IF(T54<'User Parameters'!$J$5,'User Parameters'!$J$5,IF(T54>'User Parameters'!$J$6,'User Parameters'!$J$6,T54))","v":0.71000392539810686},0,0,{"$f":"(B54-C54-F54-E54-S54-V54)/'Results Dashboard'!$D$42","v":0.20199568206208246},{"$f":"IF((X54+W54)>0,(X54+W54)*0.5*((1+'User Parameters'!C$48)^((12+UP_COC_WithholdLag)/12)-1),(X54+W54)*0.5*((1+'User Parameters'!$C$49)^((12+UP_COC_WithholdLag)/12)-1))","v":0},{"$f":"-'User Parameters'!$C$12*('User Parameters'!$C$13-1)","v":0},0.20199568206208246,0.99999987702644799,1.5063044667140701E-7,1.5063044667140701E-7,{"$f":"IF($AA54<-'Results Dashboard'!$J$7,$AA54+'Results Dashboard'!$J$7,0)","v":0},{"$f":"IF($AA54<-'Results Dashboard'!$J$8,$AA54+'Results Dashboard'!$J$8,0)","v":0},{"$f":"IF($AA54<-'Results Dashboard'!$J$9,$AA54+'Results Dashboard'!$J$9,0)","v":0},{"$f":"IF($AA54<-'Results Dashboard'!$J$11,$AA54+'Results Dashboard'!$J$11,0)","v":0},{"$f":"IF($AA54<-'Results Dashboard'!$J$10,$AA54+'Results Dashboard'!$J$10,0)","v":0},null,{"$f":"IF((X54+W54)>0,(X54+W54)*0.5*'User Parameters'!C$48,(X54+W54)*0.5*'User Parameters'!$C$49)","v":0},{"$f":"-'User Parameters'!$C$12*('User Parameters'!$C$13-1)","v":0},0.20199568206208246]
[0.71500392539810687,454.54342697283204,325.00033454948266,0.71500392539810687,{"$f":"'User Parameters'!$C$10","v":40},{"$f":"B55*'User Parameters'!$C$14","v":0},89.543092423349378,0.19699568206208237,0.71500392539810687,{"$f":"IF(UP_RSBasis=\"MLR\",UP_RSTarget_MLR,IF(UP_RSBasis=\"Medical Baseline\",UP_RSTarget_Medlcal,0))","v":0},0,0,0,0,0,0,0,"",0,{"$f":"(S55+C55+'User Parameters'!$C$11)/(B55-F55)","v":0.71500392539810687},{"$f":"IF(T55<'User Parameters'!$J$5,'User Parameters'!$J$5,IF(T55>'User Parameters'!$J$6,'User Parameters'!$J$6,T55))","v":0.71500392539810687},0,0,{"$f":"(B55-C55-F55-E55-S55-V55)/'Results Dashboard'!$D$42","v":0.19699568206208237},{"$f":"IF((X55+W55)>0,(X55+W55)*0.5*((1+'User Parameters'!C$48)^((12+UP_COC_WithholdLag)/12)-1),(X55+W55)*0.5*((1+'User Parameters'!$C$49)^((12+UP_COC_WithholdLag)/12)-1))","v":0},{"$f":"-'User Parameters'!$C$12*('User Parameters'!$C$13-1)","v":0},0.19699568206208237,0.99999972639600132,3.2172027886190335E-7,3.2172027886190335E-7,{"$f":"IF($AA55<-'Results Dashboard'!$J$7,$AA55+'Results Dashboard'!$J$7,0)","v":0},{"$f":"IF($AA55<-'Results Dashboard'!$J$8,$AA55+'Results Dashboard'!$J$8,0)","v":0},{"$f":"IF($AA55<-'Results Dashboard'!$J$9,$AA55+'Results Dashboard'!$J$9,0)","v":0},{"$f":"IF($AA55<-'Results Dashboard'!$J$11,$AA55+'Results Dashboard'!$J$11,0)","v":0},{"$f":"IF($AA55<-'Results Dashboard'!$J$10,$AA55+'Results Dashboard'!$J$10,0)","v":0},null,{"$f":"IF((X55+W55)>0,(X55+W55)*0.5*'User Parameters'!C$48,(X55+W55)*0.5*'User Parameters'!$C$49)","v":0},{"$f":"-'User Parameters'!$C$12*('User Parameters'!$C$13-1)","v":0},0.19699568206208237]
[0.72000392539810687,454.54342697283204,327.2730516843468,0.72000392539810687,{"$f":"'User Parameters'!$C$10","v":40},{"$f":"B56*'User Parameters'!$C$14","v":0},87.270375288485241,0.19199568206208242,0.72000392539810687,{"$f":"IF(UP_RSBasis=\"MLR\",UP_RSTarget_MLR,IF(UP_RSBasis=\"Medical Baseline\",UP_RSTarget_Medlcal,0))","v":0},0,0,0,0,0,0,0,"",0,{"$f":"(S56+C56+'User Parameters'!$C$11)/(B56-F56)","v":0.72000392539810687},{"$f":"IF(T56<'User Parameters'!$J$5,'User Parameters'!$J$5,IF(T56>'User Parameters'!$J$6,'User Parameters'!$J$6,T56))","v":0.72000392539810687},0,0,{"$f":"(B56-C56-F56-E56-S56-V56)/'Results Dashboard'!$D$42","v":0.19199568206208242},{"$f":"IF((X56+W56)>0,(X56+W56)*0.5*((1+'User Parameters'!C$48)^((12+UP_COC_WithholdLag)/12)-1),(X56+W56)*0.5*((1+'User Parameters'!$C$49)^((12+UP_COC_WithholdLag)/12)-1))","v":0},{"$f":"-'User Parameters'!$C$12*('User Parameters'!$C$13-1)","v":0},0.19199568206208242,0.99999940467572246,6.7151686899968865E-7,6.7151686899968865E-7,{"$f":"IF($AA56<-'Results Dashboard'!$J$7,$AA56+'Results Dashboard'!$J$7,0)","v":0},{"$f":"IF($AA56<-'Results Dashboard'!$J$8,$AA56+'Results Dashboard'!$J$8,0)","v":0},{"$f":"IF($AA56<-'Results Dashboard'!$J$9,$AA56+'Results Dashboard'!$J$9,0)","v":0},{"$f":"IF($AA56<-'Results Dashboard'!$J$11,$AA56+'Results Dashboard'!$J$11,0)","v":0},{"$f":"IF($AA56<-'Results Dashboard'!$J$10,$AA56+'Results Dashboard'!$J$10,0)","v":0},null,{"$f":"IF((X56+W56)>0,(X56+W56)*0.5*'User Parameters'!C$48,(X56+W56)*0.5*'User Parameters'!$C$49)","v":0},{"$f":"-'User Parameters'!$C$12*('User Parameters'!$C$13-1)","v":0},0.19199568206208242]
[0.72500392539810687,454.54342697283204,329.54576881921093,0.72500392539810687,{"$f":"'User Parameters'!$C$10","v":40},{"$f":"B57*'User Parameters'!$C$14","v":0},84.997658153621103,0.18699568206208247,0.72500392539810687,{"$f":"IF(UP_RSBasis=\"MLR\",UP_RSTarget_MLR,IF(UP_RSBasis=\"Medical Baseline\",UP_RSTarget_Medlcal,0))","v":0},0,0,0,0,0,0,0,"",0,{"$f":"(S57+C57+'User Parameters'!$C$11)/(B57-F57)","v":0.72500392539810687},{"$f":"IF(T57<'User Parameters'!$J$5,'User Parameters'!$J$5,IF(T57>'User Parameters'!$J$6,'User Parameters'!$J$6,T57))","v":0.72500392539810687},0,0,{"$f":"(B57-C57-F57-E57-S57-V57)/'Results Dashboard'!$D$42","v":0.18699568206208247},{"$f":"IF((X57+W57)>0,(X57+W57)*0.5*((1+'User Parameters'!C$48)^((12+UP_COC_WithholdLag)/12)-1),(X57+W57)*0.5*((1+'User Parameters'!$C$49)^((12+UP_COC_WithholdLag)/12)-1))","v":0},{"$f":"-'User Parameters'!$C$12*('User Parameters'!$C$13-1)","v":0},0.18699568206208247,0.99999873315885346,1.3697719433158895E-6,1.3697719433158895E-6,{"$f":"IF($AA57<-'Results Dashboard'!$J$7,$AA57+'Results Dashboard'!$J$7,0)","v":0},{"$f":"IF($AA57<-'Results Dashboard'!$J$8,$AA57+'Results Dashboard'!$J$8,0)","v":0},{"$f":"IF($AA57<-'Results Dashboard'!$J$9,$AA57+'Results Dashboard'!$J$9,0)","v":0},{"$f":"IF($AA57<-'Results Dashboard'!$J$11,$AA57+'Results Dashboard'!$J$11,0)","v":0},{"$f":"IF($AA57<-'Results Dashboard'!$J$10,$AA57+'Results Dashboard'!$J$10,0)","v":0},null,{"$f":"IF((X57+W57)>0,(X57+W57)*0.5*'User Parameters'!C$48,(X57+W57)*0.5*'User Parameters'!$C$49)","v":0},{"$f":"-'User Parameters'!$C$12*('User Parameters'!$C$13-1)","v":0},0.18699568206208247]
[0.73000392539810688,454.54342697283204,331.81848595407513,0.73000392539810688,{"$f":"'User Parameters'!$C$10","v":40},{"$f":"B58*'User Parameters'!$C$14","v":0},82.724941018756908,0.18199568206208239,0.73000392539810688,{"$f":"IF(UP_RSBasis=\"MLR\",UP_RSTarget_MLR,IF(UP_RSBasis=\"Medical Baseline\",UP_RSTarget_Medlcal,0))","v":0},0,0,0,0,0,0,0,"",0,{"$f":"(S58+C58+'User Parameters'!$C$11)/(B58-F58)","v":0.73000392539810688},{"$f":"IF(T58<'User Parameters'!$J$5,'User Parameters'!$J$5,IF(T58>'User Parameters'!$J$6,'User Parameters'!$J$6,T58))","v":0.73000392539810688},0,0,{"$f":"(B58-C58-F58-E58-S58-V58)/'Results Dashboard'!$D$42","v":0.18199568206208239},{"$f":"IF((X58+W58)>0,(X58+W58)*0.5*((1+'User Parameters'!C$48)^((12+UP_COC_WithholdLag)/12)-1),(X58+W58)*0.5*((1+'User Parameters'!$C$49)^((12+UP_COC_WithholdLag)/12)-1))","v":0},{"$f":"-'User Parameters'!$C$12*('User Parameters'!$C$13-1)","v":0},0.18199568206208239,0.99999736338691014,2.7305647872788441E-6,2.7305647872788441E-6,{"$f":"IF($AA58<-'Results Dashboard'!$J$7,$AA58+'Results Dashboard'!$J$7,0)","v":0},{"$f":"IF($AA58<-'Results Dashboard'!$J$8,$AA58+'Results Dashboard'!$J$8,0)","v":0},{"$f":"IF($AA58<-'Results Dashboard'!$J$9,$AA58+'Results Dashboard'!$J$9,0)","v":0},{"$f":"IF($AA58<-'Results Dashboard'!$J$11,$AA58+'Results Dashboard'!$J$11,0)","v":0},{"$f":"IF($AA58<-'Results Dashboard'!$J$10,$AA58+'Results Dashboard'!$J$10,0)","v":0},null,{"$f":"IF((X58+W58)>0,(X58+W58)*0.5*'User Parameters'!C$48,(X58+W58)*0.5*'User Parameters'!$C$49)","v":0},{"$f":"-'User Parameters'!$C$12*('User Parameters'!$C$13-1)","v":0},0.18199568206208239]
[0.73500392539810688,454.54342697283204,334.09120308893927,0.73500392539810688,{"$f":"'User Parameters'!$C$10","v":40},{"$f":"B59*'User Parameters'!$C$14","v":0},80.452223883892771,0.17699568206208244,0.73500392539810688,{"$f":"IF(UP_RSBasis=\"MLR\",UP_RSTarget_MLR,IF(UP_RSBasis=\"Medical Baseline\",UP_RSTarget_Medlcal,0))","v":0},0,0,0,0,0,0,0,"",0,{"$f":"(S59+C59+'User Parameters'!$C$11)/(B59-F59)","v":0.73500392539810688},{"$f":"IF(T59<'User Parameters'!$J$5,'User Parameters'!$J$5,IF(T59>'User Parameters'!$J$6,'User Parameters'!$J$6,T59))","v":0.73500392539810688},0,0,{"$f":"(B59-C59-F59-E59-S59-V59)/'Results Dashboard'!$D$42","v":0.17699568206208244},{"$f":"IF((X59+W59)>0,(X59+W59)*0.5*((1+'User Parameters'!C$48)^((12+UP_COC_WithholdLag)/12)-1),(X59+W59)*0.5*((1+'User Parameters'!$C$49)^((12+UP_COC_WithholdLag)/12)-1))","v":0},{"$f":"-'User Parameters'!$C$12*('User Parameters'!$C$13-1)","v":0},0.17699568206208244,0.99999463282212286,5.3194853005811282E-6,5.3194853005811282E-6,{"$f":"IF($AA59<-'Results Dashboard'!$J$7,$AA59+'Results Dashboard'!$J$7,0)","v":0},{"$f":"IF($AA59<-'Results Dashboard'!$J$8,$AA59+'Results Dashboard'!$J$8,0)","v":0},{"$f":"IF($AA59<-'Results Dashboard'!$J$9,$AA59+'Results Dashboard'!$J$9,0)","v":0},{"$f":"IF($AA59<-'Results Dashboard'!$J$11,$AA59+'Results Dashboard'!$J$11,0)","v":0},{"$f":"IF($AA59<-'Results Dashboard'!$J$10,$AA59+'Results Dashboard'!$J$10,0)","v":0},null,{"$f":"IF((X59+W59)>0,(X59+W59)*0.5*'User Parameters'!C$48,(X59+W59)*0.5*'User Parameters'!$C$49)","v":0},{"$f":"-'User Parameters'!$C$12*('User Parameters'!$C$13-1)","v":0},0.17699568206208244]
[0.74000392539810689,454.54342697283204,336.36392022380346,0.74000392539810689,{"$f":"'User Parameters'!$C$10","v":40},{"$f":"B60*'User Parameters'!$C$14","v":0},78.179506749028576,0.17199568206208238,0.74000392539810689,{"$f":"IF(UP_RSBasis=\"MLR\",UP_RSTarget_MLR,IF(UP_RSBasis=\"Medical Baseline\",UP_RSTarget_Medlcal,0))","v":0},0,0,0,0,0,0,0,"",0,{"$f":"(S60+C60+'User Parameters'!$C$11)/(B60-F60)","v":0.74000392539810689},{"$f":"IF(T60<'User Parameters'!$J$5,'User Parameters'!$J$5,IF(T60>'User Parameters'!$J$6,'User Parameters'!$J$6,T60))","v":0.74000392539810689},0,0,{"$f":"(B60-C60-F60-E60-S60-V60)/'Results Dashboard'!$D$42","v":0.17199568206208238},{"$f":"IF((X60+W60)>0,(X60+W60)*0.5*((1+'User Parameters'!C$48)^((12+UP_COC_WithholdLag)/12)-1),(X60+W60)*0.5*((1+'User Parameters'!$C$49)^((12+UP_COC_WithholdLag)/12)-1))","v":0},{"$f":"-'User Parameters'!$C$12*('User Parameters'!$C$13-1)","v":0},0.17199568206208238,0.99998931333682228,1.0127439984297659E-5,1.0127439984297659E-5,{"$f":"IF($AA60<-'Results Dashboard'!$J$7,$AA60+'Results Dashboard'!$J$7,0)","v":0},{"$f":"IF($AA60<-'Results Dashboard'!$J$8,$AA60+'Results Dashboard'!$J$8,0)","v":0},{"$f":"IF($AA60<-'Results Dashboard'!$J$9,$AA60+'Results Dashboard'!$J$9,0)","v":0},{"$f":"IF($AA60<-'Results Dashboard'!$J$11,$AA60+'Results Dashboard'!$J$11,0)","v":0},{"$f":"IF($AA60<-'Results Dashboard'!$J$10,$AA60+'Results Dashboard'!$J$10,0)","v":0},null,{"$f":"IF((X60+W60)>0,(X60+W60)*0.5*'User Parameters'!C$48,(X60+W60)*0.5*'User Parameters'!$C$49)","v":0},{"$f":"-'User Parameters'!$C$12*('User Parameters'!$C$13-1)","v":0},0.17199568206208238]
[0.74500392539810689,454.54342697283204,338.6366373586676,0.74500392539810689,{"$f":"'User Parameters'!$C$10","v":40},{"$f":"B61*'User Parameters'!$C$14","v":0},75.906789614164438,0.16699568206208243,0.74500392539810689,{"$f":"IF(UP_RSBasis=\"MLR\",UP_RSTarget_MLR,IF(UP_RSBasis=\"Medical Baseline\",UP_RSTarget_Medlcal,0))","v":0},0,0,0,0,0,0,0,"",0,{"$f":"(S61+C61+'User Parameters'!$C$11)/(B61-F61)","v":0.74500392539810689},{"$f":"IF(T61<'User Parameters'!$J$5,'User Parameters'!$J$5,IF(T61>'User Parameters'!$J$6,'User Parameters'!$J$6,T61))","v":0.74500392539810689},0,0,{"$f":"(B61-C61-F61-E61-S61-V61)/'Results Dashboard'!$D$42","v":0.16699568206208243},{"$f":"IF((X61+W61)>0,(X61+W61)*0.5*((1+'User Parameters'!C$48)^((12+UP_COC_WithholdLag)/12)-1),(X61+W61)*0.5*((1+'User Parameters'!$C$49)^((12+UP_COC_WithholdLag)/12)-1))","v":0},{"$f":"-'User Parameters'!$C$12*('User Parameters'!$C$13-1)","v":0},0.16699568206208243,0.99997918589683799,1.8842681539288364E-5,1.8842681539288364E-5,{"$f":"IF($AA61<-'Results Dashboard'!$J$7,$AA61+'Results Dashboard'!$J$7,0)","v":0},{"$f":"IF($AA61<-'Results Dashboard'!$J$8,$AA61+'Results Dashboard'!$J$8,0)","v":0},{"$f":"IF($AA61<-'Results Dashboard'!$J$9,$AA61+'Results Dashboard'!$J$9,0)","v":0},{"$f":"IF($AA61<-'Results Dashboard'!$J$11,$AA61+'Results Dashboard'!$J$11,0)","v":0},{"$f":"IF($AA61<-'Results Dashboard'!$J$10,$AA61+'Results Dashboard'!$J$10,0)","v":0},null,{"$f":"IF((X61+W61)>0,(X61+W61)*0.5*'User Parameters'!C$48,(X61+W61)*0.5*'User Parameters'!$C$49)","v":0},{"$f":"-'User Parameters'!$C$12*('User Parameters'!$C$13-1)","v":0},0.16699568206208243]
[0.7500039253981069,454.54342697283204,340.90935449353179,0.7500039253981069,{"$f":"'User Parameters'!$C$10","v":40},{"$f":"B62*'User Parameters'!$C$14","v":0},73.634072479300244,0.16199568206208234,0.7500039253981069,{"$f":"IF(UP_RSBasis=\"MLR\",UP_RSTarget_MLR,IF(UP_RSBasis=\"Medical Baseline\",UP_RSTarget_Medlcal,0))","v":0},0,0,0,0,0,0,0,"",0,{"$f":"(S62+C62+'User Parameters'!$C$11)/(B62-F62)","v":0.7500039253981069},{"$f":"IF(T62<'User Parameters'!$J$5,'User Parameters'!$J$5,IF(T62>'User Parameters'!$J$6,'User Parameters'!$J$6,T62))","v":0.7500039253981069},0,0,{"$f":"(B62-C62-F62-E62-S62-V62)/'Results Dashboard'!$D$42","v":0.16199568206208234},{"$f":"IF((X62+W62)>0,(X62+W62)*0.5*((1+'User Parameters'!C$48)^((12+UP_COC_WithholdLag)/12)-1),(X62+W62)*0.5*((1+'User Parameters'!$C$49)^((12+UP_COC_WithholdLag)/12)-1))","v":0},{"$f":"-'User Parameters'!$C$12*('User Parameters'!$C$13-1)","v":0},0.16199568206208234,0.9999603432152987,3.4260897030735649E-5,3.4260897030735649E-5,{"$f":"IF($AA62<-'Results Dashboard'!$J$7,$AA62+'Results Dashboard'!$J$7,0)","v":0},{"$f":"IF($AA62<-'Results Dashboard'!$J$8,$AA62+'Results Dashboard'!$J$8,0)","v":0},{"$f":"IF($AA62<-'Results Dashboard'!$J$9,$AA62+'Results Dashboard'!$J$9,0)","v":0},{"$f":"IF($AA62<-'Results Dashboard'!$J$11,$AA62+'Results Dashboard'!$J$11,0)","v":0},{"$f":"IF($AA62<-'Results Dashboard'!$J$10,$AA62+'Results Dashboard'!$J$10,0)","v":0},null,{"$f":"IF((X62+W62)>0,(X62+W62)*0.5*'User Parameters'!C$48,(X62+W62)*0.5*'User Parameters'!$C$49)","v":0},{"$f":"-'User Parameters'!$C$12*('User Parameters'!$C$13-1)","v":0},0.16199568206208234]
[0.7550039253981069,454.54342697283204,343.18207162839593,0.7550039253981069,{"$f":"'User Parameters'!$C$10","v":40},{"$f":"B63*'User Parameters'!$C$14","v":0},71.361355344436106,0.15699568206208239,0.7550039253981069,{"$f":"IF(UP_RSBasis=\"MLR\",UP_RSTarget_MLR,IF(UP_RSBasis=\"Medical Baseline\",UP_RSTarget_Medlcal,0))","v":0},0,0,0,0,0,0,0,"",0,{"$f":"(S63+C63+'User Parameters'!$C$11)/(B63-F63)","v":0.7550039253981069},{"$f":"IF(T63<'User Parameters'!$J$5,'User Parameters'!$J$5,IF(T63>'User Parameters'!$J$6,'User Parameters'!$J$6,T63))","v":0.7550039253981069},0,0,{"$f":"(B63-C63-F63-E63-S63-V63)/'Results Dashboard'!$D$42","v":0.15699568206208239},{"$f":"IF((X63+W63)>0,(X63+W63)*0.5*((1+'User Parameters'!C$48)^((12+UP_COC_WithholdLag)/12)-1),(X63+W63)*0.5*((1+'User Parameters'!$C$49)^((12+UP_COC_WithholdLag)/12)-1))","v":0},{"$f":"-'User Parameters'!$C$12*('User Parameters'!$C$13-1)","v":0},0.15699568206208239,0.99992608231826796,6.0879036199890102E-5,6.0879036199890102E-5,{"$f":"IF($AA63<-'Results Dashboard'!$J$7,$AA63+'Results Dashboard'!$J$7,0)","v":0},{"$f":"IF($AA63<-'Results Dashboard'!$J$8,$AA63+'Results Dashboard'!$J$8,0)","v":0},{"$f":"IF($AA63<-'Results Dashboard'!$J$9,$AA63+'Results Dashboard'!$J$9,0)","v":0},{"$f":"IF($AA63<-'Results Dashboard'!$J$11,$AA63+'Results Dashboard'!$J$11,0)","v":0},{"$f":"IF($AA63<-'Results Dashboard'!$J$10,$AA63+'Results Dashboard'!$J$10,0)","v":0},null,{"$f":"IF((X63+W63)>0,(X63+W63)*0.5*'User Parameters'!C$48,(X63+W63)*0.5*'User Parameters'!$C$49)","v":0},{"$f":"-'User Parameters'!$C$12*('User Parameters'!$C$13-1)","v":0},0.15699568206208239]
[0.76000392539810691,454.54342697283204,345.45478876326007,0.76000392539810691,{"$f":"'User Parameters'!$C$10","v":40},{"$f":"B64*'User Parameters'!$C$14","v":0},69.088638209571968,0.15199568206208244,0.76000392539810691,{"$f":"IF(UP_RSBasis=\"MLR\",UP_RSTarget_MLR,IF(UP_RSBasis=\"Medical Baseline\",UP_RSTarget_Medlcal,0))","v":0},0,0,0,0,0,0,0,"",0,{"$f":"(S64+C64+'User Parameters'!$C$11)/(B64-F64)","v":0.76000392539810691},{"$f":"IF(T64<'User Parameters'!$J$5,'User Parameters'!$J$5,IF(T64>'User Parameters'!$J$6,'User Parameters'!$J$6,T64))","v":0.76000392539810691},0,0,{"$f":"(B64-C64-F64-E64-S64-V64)/'Results Dashboard'!$D$42","v":0.15199568206208244},{"$f":"IF((X64+W64)>0,(X64+W64)*0.5*((1+'User Parameters'!C$48)^((12+UP_COC_WithholdLag)/12)-1),(X64+W64)*0.5*((1+'User Parameters'!$C$49)^((12+UP_COC_WithholdLag)/12)-1))","v":0},{"$f":"-'User Parameters'!$C$12*('User Parameters'!$C$13-1)","v":0},0.15199568206208244,0.99986520328206807,1.0571822166305367E-4,1.0571822166305367E-4,{"$f":"IF($AA64<-'Results Dashboard'!$J$7,$AA64+'Results Dashboard'!$J$7,0)","v":0},{"$f":"IF($AA64<-'Results Dashboard'!$J$8,$AA64+'Results Dashboard'!$J$8,0)","v":0},{"$f":"IF($AA64<-'Results Dashboard'!$J$9,$AA64+'Results Dashboard'!$J$9,0)","v":0},{"$f":"IF($AA64<-'Results Dashboard'!$J$11,$AA64+'Results Dashboard'!$J$11,0)","v":0},{"$f":"IF($AA64<-'Results Dashboard'!$J$10,$AA64+'Results Dashboard'!$J$10,0)","v":0},null,{"$f":"IF((X64+W64)>0,(X64+W64)*0.5*'User Parameters'!C$48,(X64+W64)*0.5*'User Parameters'!$C$49)","v":0},{"$f":"-'User Parameters'!$C$12*('User Parameters'!$C$13-1)","v":0},0.15199568206208244]
[0.76500392539810691,454.54342697283204,347.72750589812426,0.76500392539810691,{"$f":"'User Parameters'!$C$10","v":40},{"$f":"B65*'User Parameters'!$C$14","v":0},66.815921074707774,0.14699568206208236,0.76500392539810691,{"$f":"IF(UP_RSBasis=\"MLR\",UP_RSTarget_MLR,IF(UP_RSBasis=\"Medical Baseline\",UP_RSTarget_Medlcal,0))","v":0},0,0,0,0,0,0,0,"",0,{"$f":"(S65+C65+'User Parameters'!$C$11)/(B65-F65)","v":0.76500392539810691},{"$f":"IF(T65<'User Parameters'!$J$5,'User Parameters'!$J$5,IF(T65>'User Parameters'!$J$6,'User Parameters'!$J$6,T65))","v":0.76500392539810691},0,0,{"$f":"(B65-C65-F65-E65-S65-V65)/'Results Dashboard'!$D$42","v":0.14699568206208236},{"$f":"IF((X65+W65)>0,(X65+W65)*0.5*((1+'User Parameters'!C$48)^((12+UP_COC_WithholdLag)/12)-1),(X65+W65)*0.5*((1+'User Parameters'!$C$49)^((12+UP_COC_WithholdLag)/12)-1))","v":0},{"$f":"-'User Parameters'!$C$12*('User Parameters'!$C$13-1)","v":0},0.14699568206208236,0.99975948506040502,1.794093181326506E-4,1.794093181326506E-4,{"$f":"IF($AA65<-'Results Dashboard'!$J$7,$AA65+'Results Dashboard'!$J$7,0)","v":0},{"$f":"IF($AA65<-'Results Dashboard'!$J$8,$AA65+'Results Dashboard'!$J$8,0)","v":0},{"$f":"IF($AA65<-'Results Dashboard'!$J$9,$AA65+'Results Dashboard'!$J$9,0)","v":0},{"$f":"IF($AA65<-'Results Dashboard'!$J$11,$AA65+'Results Dashboard'!$J$11,0)","v":0},{"$f":"IF($AA65<-'Results Dashboard'!$J$10,$AA65+'Results Dashboard'!$J$10,0)","v":0},null,{"$f":"IF((X65+W65)>0,(X65+W65)*0.5*'User Parameters'!C$48,(X65+W65)*0.5*'User Parameters'!$C$49)","v":0},{"$f":"-'User Parameters'!$C$12*('User Parameters'!$C$13-1)","v":0},0.14699568206208236]
[0.77000392539810691,454.54342697283204,350.0002230329884,0.77000392539810691,{"$f":"'User Parameters'!$C$10","v":40},{"$f":"B66*'User Parameters'!$C$14","v":0},64.543203939843636,0.14199568206208241,0.77000392539810691,{"$f":"IF(UP_RSBasis=\"MLR\",UP_RSTarget_MLR,IF(UP_RSBasis=\"Medical Baseline\",UP_RSTarget_Medlcal,0))","v":0},0,0,0,0,0,0,0,"",0,{"$f":"(S66+C66+'User Parameters'!$C$11)/(B66-F66)","v":0.77000392539810691},{"$f":"IF(T66<'User Parameters'!$J$5,'User Parameters'!$J$5,IF(T66>'User Parameters'!$J$6,'User Parameters'!$J$6,T66))","v":0.77000392539810691},0,0,{"$f":"(B66-C66-F66-E66-S66-V66)/'Results Dashboard'!$D$42","v":0.14199568206208241},{"$f":"IF((X66+W66)>0,(X66+W66)*0.5*((1+'User Parameters'!C$48)^((12+UP_COC_WithholdLag)/12)-1),(X66+W66)*0.5*((1+'User Parameters'!$C$49)^((12+UP_COC_WithholdLag)/12)-1))","v":0},{"$f":"-'User Parameters'!$C$12*('User Parameters'!$C$13-1)","v":0},0.14199568206208241,0.99958007574227237,2.9754539340975938E-4,2.9754539340975938E-4,{"$f":"IF($AA66<-'Results Dashboard'!$J$7,$AA66+'Results Dashboard'!$J$7,0)","v":0},{"$f":"IF($AA66<-'Results Dashboard'!$J$8,$AA66+'Results Dashboard'!$J$8,0)","v":0},{"$f":"IF($AA66<-'Results Dashboard'!$J$9,$AA66+'Results Dashboard'!$J$9,0)","v":0},{"$f":"IF($AA66<-'Results Dashboard'!$J$11,$AA66+'Results Dashboard'!$J$11,0)","v":0},{"$f":"IF($AA66<-'Results Dashboard'!$J$10,$AA66+'Results Dashboard'!$J$10,0)","v":0},null,{"$f":"IF((X66+W66)>0,(X66+W66)*0.5*'User Parameters'!C$48,(X66+W66)*0.5*'User Parameters'!$C$49)","v":0},{"$f":"-'User Parameters'!$C$12*('User Parameters'!$C$13-1)","v":0},0.14199568206208241]
[0.77500392539810692,454.54342697283204,352.2729401678526,0.77500392539810692,{"$f":"'User Parameters'!$C$10","v":40},{"$f":"B67*'User Parameters'!$C$14","v":0},62.270486804979441,0.13699568206208235,0.77500392539810692,{"$f":"IF(UP_RSBasis=\"MLR\",UP_RSTarget_MLR,IF(UP_RSBasis=\"Medical Baseline\",UP_RSTarget_Medlcal,0))","v":0},0,0,0,0,0,0,0,"",0,{"$f":"(S67+C67+'User Parameters'!$C$11)/(B67-F67)","v":0.77500392539810692},{"$f":"IF(T67<'User Parameters'!$J$5,'User Parameters'!$J$5,IF(T67>'User Parameters'!$J$6,'User Parameters'!$J$6,T67))","v":0.77500392539810692},0,0,{"$f":"(B67-C67-F67-E67-S67-V67)/'Results Dashboard'!$D$42","v":0.13699568206208235},{"$f":"IF((X67+W67)>0,(X67+W67)*0.5*((1+'User Parameters'!C$48)^((12+UP_COC_WithholdLag)/12)-1),(X67+W67)*0.5*((1+'User Parameters'!$C$49)^((12+UP_COC_WithholdLag)/12)-1))","v":0},{"$f":"-'User Parameters'!$C$12*('User Parameters'!$C$13-1)","v":0},0.13699568206208235,0.99928253034886261,4.8225259903633688E-4,4.8225259903633688E-4,{"$f":"IF($AA67<-'Results Dashboard'!$J$7,$AA67+'Results Dashboard'!$J$7,0)","v":0},{"$f":"IF($AA67<-'Results Dashboard'!$J$8,$AA67+'Results Dashboard'!$J$8,0)","v":0},{"$f":"IF($AA67<-'Results Dashboard'!$J$9,$AA67+'Results Dashboard'!$J$9,0)","v":0},{"$f":"IF($AA67<-'Results Dashboard'!$J$11,$AA67+'Results Dashboard'!$J$11,0)","v":0},{"$f":"IF($AA67<-'Results Dashboard'!$J$10,$AA67+'Results Dashboard'!$J$10,0)","v":0},null,{"$f":"IF((X67+W67)>0,(X67+W67)*0.5*'User Parameters'!C$48,(X67+W67)*0.5*'User Parameters'!$C$49)","v":0},{"$f":"-'User Parameters'!$C$12*('User Parameters'!$C$13-1)","v":0},0.13699568206208235]
[0.78000392539810692,454.54342697283204,354.54565730271673,0.78000392539810692,{"$f":"'User Parameters'!$C$10","v":40},{"$f":"B68*'User Parameters'!$C$14","v":0},59.997769670115304,0.1319956820620824,0.78000392539810692,{"$f":"IF(UP_RSBasis=\"MLR\",UP_RSTarget_MLR,IF(UP_RSBasis=\"Medical Baseline\",UP_RSTarget_Medlcal,0))","v":0},0,0,0,0,0,0,0,"",0,{"$f":"(S68+C68+'User Parameters'!$C$11)/(B68-F68)","v":0.78000392539810692},{"$f":"IF(T68<'User Parameters'!$J$5,'User Parameters'!$J$5,IF(T68>'User Parameters'!$J$6,'User Parameters'!$J$6,T68))","v":0.78000392539810692},0,0,{"$f":"(B68-C68-F68-E68-S68-V68)/'Results Dashboard'!$D$42","v":0.1319956820620824},{"$f":"IF((X68+W68)>0,(X68+W68)*0.5*((1+'User Parameters'!C$48)^((12+UP_COC_WithholdLag)/12)-1),(X68+W68)*0.5*((1+'User Parameters'!$C$49)^((12+UP_COC_WithholdLag)/12)-1))","v":0},{"$f":"-'User Parameters'!$C$12*('User Parameters'!$C$13-1)","v":0},0.1319956820620824,0.99880027774982627,7.6385170880599595E-4,7.6385170880599595E-4,{"$f":"IF($AA68<-'Results Dashboard'!$J$7,$AA68+'Results Dashboard'!$J$7,0)","v":0},{"$f":"IF($AA68<-'Results Dashboard'!$J$8,$AA68+'Results Dashboard'!$J$8,0)","v":0},{"$f":"IF($AA68<-'Results Dashboard'!$J$9,$AA68+'Results Dashboard'!$J$9,0)","v":0},{"$f":"IF($AA68<-'Results Dashboard'!$J$11,$AA68+'Results Dashboard'!$J$11,0)","v":0},{"$f":"IF($AA68<-'Results Dashboard'!$J$10,$AA68+'Results Dashboard'!$J$10,0)","v":0},null,{"$f":"IF((X68+W68)>0,(X68+W68)*0.5*'User Parameters'!C$48,(X68+W68)*0.5*'User Parameters'!$C$49)","v":0},{"$f":"-'User Parameters'!$C$12*('User Parameters'!$C$13-1)","v":0},0.1319956820620824]
[0.78500392539810693,454.54342697283204,356.81837443758093,0.78500392539810693,{"$f":"'User Parameters'!$C$10","v":40},{"$f":"B69*'User Parameters'!$C$14","v":0},57.725052535251109,0.12699568206208231,0.78500392539810693,{"$f":"IF(UP_RSBasis=\"MLR\",UP_RSTarget_MLR,IF(UP_RSBasis=\"Medical Baseline\",UP_RSTarget_Medlcal,0))","v":0},0,0,0,0,0,0,0,"",0,{"$f":"(S69+C69+'User Parameters'!$C$11)/(B69-F69)","v":0.78500392539810693},{"$f":"IF(T69<'User Parameters'!$J$5,'User Parameters'!$J$5,IF(T69>'User Parameters'!$J$6,'User Parameters'!$J$6,T69))","v":0.78500392539810693},0,0,{"$f":"(B69-C69-F69-E69-S69-V69)/'Results Dashboard'!$D$42","v":0.12699568206208231},{"$f":"IF((X69+W69)>0,(X69+W69)*0.5*((1+'User Parameters'!C$48)^((12+UP_COC_WithholdLag)/12)-1),(X69+W69)*0.5*((1+'User Parameters'!$C$49)^((12+UP_COC_WithholdLag)/12)-1))","v":0},{"$f":"-'User Parameters'!$C$12*('User Parameters'!$C$13-1)","v":0},0.12699568206208231,0.99803642604102027,1.1823789349419966E-3,1.1823789349419966E-3,{"$f":"IF($AA69<-'Results Dashboard'!$J$7,$AA69+'Results Dashboard'!$J$7,0)","v":0},{"$f":"IF($AA69<-'Results Dashboard'!$J$8,$AA69+'Results Dashboard'!$J$8,0)","v":0},{"$f":"IF($AA69<-'Results Dashboard'!$J$9,$AA69+'Results Dashboard'!$J$9,0)","v":0},{"$f":"IF($AA69<-'Results Dashboard'!$J$11,$AA69+'Results Dashboard'!$J$11,0)","v":0},{"$f":"IF($AA69<-'Results Dashboard'!$J$10,$AA69+'Results Dashboard'!$J$10,0)","v":0},null,{"$f":"IF((X69+W69)>0,(X69+W69)*0.5*'User Parameters'!C$48,(X69+W69)*0.5*'User Parameters'!$C$49)","v":0},{"$f":"-'User Parameters'!$C$12*('User Parameters'!$C$13-1)","v":0},0.12699568206208231]
[0.79000392539810693,454.54342697283204,359.09109157244507,0.79000392539810693,{"$f":"'User Parameters'!$C$10","v":40},{"$f":"B70*'User Parameters'!$C$14","v":0},55.452335400386971,0.12199568206208236,0.79000392539810693,{"$f":"IF(UP_RSBasis=\"MLR\",UP_RSTarget_MLR,IF(UP_RSBasis=\"Medical Baseline\",UP_RSTarget_Medlcal,0))","v":0},0,0,0,0,0,0,0,"",0,{"$f":"(S70+C70+'User Parameters'!$C$11)/(B70-F70)","v":0.79000392539810693},{"$f":"IF(T70<'User Parameters'!$J$5,'User Parameters'!$J$5,IF(T70>'User Parameters'!$J$6,'User Parameters'!$J$6,T70))","v":0.79000392539810693},0,0,{"$f":"(B70-C70-F70-E70-S70-V70)/'Results Dashboard'!$D$42","v":0.12199568206208236},{"$f":"IF((X70+W70)>0,(X70+W70)*0.5*((1+'User Parameters'!C$48)^((12+UP_COC_WithholdLag)/12)-1),(X70+W70)*0.5*((1+'User Parameters'!$C$49)^((12+UP_COC_WithholdLag)/12)-1))","v":0},{"$f":"-'User Parameters'!$C$12*('User Parameters'!$C$13-1)","v":0},0.12199568206208236,0.99685404710607828,1.7886175336607746E-3,1.7886175336607746E-3,{"$f":"IF($AA70<-'Results Dashboard'!$J$7,$AA70+'Results Dashboard'!$J$7,0)","v":0},{"$f":"IF($AA70<-'Results Dashboard'!$J$8,$AA70+'Results Dashboard'!$J$8,0)","v":0},{"$f":"IF($AA70<-'Results Dashboard'!$J$9,$AA70+'Results Dashboard'!$J$9,0)","v":0},{"$f":"IF($AA70<-'Results Dashboard'!$J$11,$AA70+'Results Dashboard'!$J$11,0)","v":0},{"$f":"IF($AA70<-'Results Dashboard'!$J$10,$AA70+'Results Dashboard'!$J$10,0)","v":0},null,{"$f":"IF((X70+W70)>0,(X70+W70)*0.5*'User Parameters'!C$48,(X70+W70)*0.5*'User Parameters'!$C$49)","v":0},{"$f":"-'User Parameters'!$C$12*('User Parameters'!$C$13-1)","v":0},0.12199568206208236]
[0.79500392539810694,454.54342697283204,361.3638087073092,0.79500392539810683,{"$f":"'User Parameters'!$C$10","v":40},{"$f":"B71*'User Parameters'!$C$14","v":0},53.179618265522834,0.11699568206208241,0.79500392539810683,{"$f":"IF(UP_RSBasis=\"MLR\",UP_RSTarget_MLR,IF(UP_RSBasis=\"Medical Baseline\",UP_RSTarget_Medlcal,0))","v":0},0,0,0,0,0,0,0,"",0,{"$f":"(S71+C71+'User Parameters'!$C$11)/(B71-F71)","v":0.79500392539810683},{"$f":"IF(T71<'User Parameters'!$J$5,'User Parameters'!$J$5,IF(T71>'User Parameters'!$J$6,'User Parameters'!$J$6,T71))","v":0.79500392539810683},0,0,{"$f":"(B71-C71-F71-E71-S71-V71)/'Results Dashboard'!$D$42","v":0.11699568206208241},{"$f":"IF((X71+W71)>0,(X71+W71)*0.5*((1+'User Parameters'!C$48)^((12+UP_COC_WithholdLag)/12)-1),(X71+W71)*0.5*((1+'User Parameters'!$C$49)^((12+UP_COC_WithholdLag)/12)-1))","v":0},{"$f":"-'User Parameters'!$C$12*('User Parameters'!$C$13-1)","v":0},0.11699568206208241,0.9950654295724175,2.6441827796211959E-3,2.6441827796211959E-3,{"$f":"IF($AA71<-'Results Dashboard'!$J$7,$AA71+'Results Dashboard'!$J$7,0)","v":0},{"$f":"IF($AA71<-'Results Dashboard'!$J$8,$AA71+'Results Dashboard'!$J$8,0)","v":0},{"$f":"IF($AA71<-'Results Dashboard'!$J$9,$AA71+'Results Dashboard'!$J$9,0)","v":0},{"$f":"IF($AA71<-'Results Dashboard'!$J$11,$AA71+'Results Dashboard'!$J$11,0)","v":0},{"$f":"IF($AA71<-'Results Dashboard'!$J$10,$AA71+'Results Dashboard'!$J$10,0)","v":0},null,{"$f":"IF((X71+W71)>0,(X71+W71)*0.5*'User Parameters'!C$48,(X71+W71)*0.5*'User Parameters'!$C$49)","v":0},{"$f":"-'User Parameters'!$C$12*('User Parameters'!$C$13-1)","v":0},0.11699568206208241]
[{"$f":"A73-0.005","v":0.80000392539810694},{"$f":"$B$88","v":454.54342697283204},363.6365258421734,0.80000392539810694,{"$f":"'User Parameters'!$C$10","v":40},{"$f":"B72*'User Parameters'!$C$14","v":0},50.906901130658639,0.11199568206208234,0.80000392539810694,{"$f":"IF(UP_RSBasis=\"MLR\",UP_RSTarget_MLR,IF(UP_RSBasis=\"Medical Baseline\",UP_RSTarget_Medlcal,0))","v":0},{"$f":"IF(UP_RSBasis=\"MLR\",J72-I72,IF(UP_RSBasis=\"Medical Baseline\",J72-$C72,0))","v":0},0,0,0,0,0,0,{"$f":"IF(UP_RSBasis=\"MLR\",SUMPRODUCT(L$4:Q$4,L72:Q72),\"\")","v":""},{"$f":"IF(UP_RSBasis=\"MLR\",R72*(B72-F72),SUMPRODUCT($L$4:$Q$4,$L72:$Q72))","v":0},{"$f":"(S72+C72+'User Parameters'!$C$11)/(B72-F72)","v":0.80000392539810694},{"$f":"IF(T72<'User Parameters'!$J$5,'User Parameters'!$J$5,IF(T72>'User Parameters'!$J$6,'User Parameters'!$J$6,T72))","v":0.80000392539810694},{"$f":"(U72-T72)*(B72-F72)","v":0},{"$f":"V72/B72","v":0},{"$f":"(B72-C72-F72-E72-S72-V72)/'Results Dashboard'!$D$42","v":0.11199568206208234},{"$f":"IF((X72+W72)>0,(X72+W72)*0.5*((1+'User Parameters'!C$48)^((12+UP_COC_WithholdLag)/12)-1),(X72+W72)*0.5*((1+'User Parameters'!$C$49)^((12+UP_COC_WithholdLag)/12)-1))","v":0},{"$f":"-'User Parameters'!$C$12*('User Parameters'!$C$13-1)","v":0},0.11199568206208234,{"$f":"_xlfn.NORM.DIST(H72,$AD$2,$AD$3,TRUE)","v":0.99242124679279631},3.8201346164576933E-3,3.8201346164576933E-3,{"$f":"IF($AA72<-'Results Dashboard'!$J$7,$AA72+'Results Dashboard'!$J$7,0)","v":0},{"$f":"IF($AA72<-'Results Dashboard'!$J$8,$AA72+'Results Dashboard'!$J$8,0)","v":0},{"$f":"IF($AA72<-'Results Dashboard'!$J$9,$AA72+'Results Dashboard'!$J$9,0)","v":0},{"$f":"IF($AA72<-'Results Dashboard'!$J$11,$AA72+'Results Dashboard'!$J$11,0)","v":0},{"$f":"IF($AA72<-'Results Dashboard'!$J$10,$AA72+'Results Dashboard'!$J$10,0)","v":0},null,{"$f":"IF((X72+W72)>0,(X72+W72)*0.5*'User Parameters'!C$48,(X72+W72)*0.5*'User Parameters'!$C$49)","v":0},{"$f":"-'User Parameters'!$C$12*('User Parameters'!$C$13-1)","v":0},0.11199568206208234]
[0.80500392539810695,454.54342697283204,{"$f":"B73*A73","v":365.90924297703754},{"$f":"(C73)/(B73)","v":0.80500392539810695},{"$f":"'User Parameters'!$C$10","v":40},{"$f":"B73*'User Parameters'!$C$14","v":0},{"$f":"B73-E73-C73-F73","v":48.634183995794501},{"$f":"G73/B73","v":0.10699568206208239},0.80500392539810695,{"$f":"IF(UP_RSBasis=\"MLR\",UP_RSTarget_MLR,IF(UP_RSBasis=\"Medical Baseline\",UP_RSTarget_Medlcal,0))","v":0},0,{"$f":"IF($K73>0,MIN(J73*L$3-J73*L$2,$K73-M73-N73),0)","v":0},{"$f":"IF($K73>0,MIN(J73*M$3-J73*M$2,$K73-N73),0)","v":0},{"$f":"IF($K73>0,MIN(J73*N$3-J73*N$2,$K73),0)","v":0},{"$f":"IF($K73<0,MAX(J73*O$2-J73*O$3,$K73),0)","v":0},{"$f":"IF($K73<0,MAX(J73*P$2-J73*P$3,$K73-O73),0)","v":0},{"$f":"IF($K73<0,MAX(J73*Q$2-J73*Q$3,$K73-P73-O73),0)","v":0},"",0,{"$f":"(S73+C73+'User Parameters'!$C$11)/(B73-F73)","v":0.80500392539810695},{"$f":"IF(T73<'User Parameters'!$J$5,'User Parameters'!$J$5,IF(T73>'User Parameters'!$J$6,'User Parameters'!$J$6,T73))","v":0.80500392539810695},0,0,{"$f":"(B73-C73-F73-E73-S73-V73)/'Results Dashboard'!$D$42","v":0.10699568206208239},{"$f":"IF((X73+W73)>0,(X73+W73)*0.5*((1+'User Parameters'!C$48)^((12+UP_COC_WithholdLag)/12)-1),(X73+W73)*0.5*((1+'User Parameters'!$C$49)^((12+UP_COC_WithholdLag)/12)-1))","v":0},{"$f":"-'User Parameters'!$C$12*('User Parameters'!$C$13-1)","v":0},{"$f":"Y73+X73-Z73","v":0.10699568206208239},0.98860111217633861,{"$f":"AB73-AB74","v":5.3936043284310564E-3},5.3936043284310564E-3,{"$f":"IF($AA73<-'Results Dashboard'!$J$7,$AA73+'Results Dashboard'!$J$7,0)","v":0},{"$f":"IF($AA73<-'Results Dashboard'!$J$8,$AA73+'Results Dashboard'!$J$8,0)","v":0},{"$f":"IF($AA73<-'Results Dashboard'!$J$9,$AA73+'Results Dashboard'!$J$9,0)","v":0},{"$f":"IF($AA73<-'Results Dashboard'!$J$11,$AA73+'Results Dashboard'!$J$11,0)","v":0},{"$f":"IF($AA73<-'Results Dashboard'!$J$10,$AA73+'Results Dashboard'!$J$10,0)","v":0},null,{"$f":"IF((X73+W73)>0,(X73+W73)*0.5*'User Parameters'!C$48,(X73+W73)*0.5*'User Parameters'!$C$49)","v":0},{"$f":"-'User Parameters'!$C$12*('User Parameters'!$C$13-1)","v":0},{"$f":"-AK73+X73-AL73","v":0.10699568206208239}]
[0.81000392539810695,454.54342697283204,368.18196011190173,0.81000392539810695,{"$f":"'User Parameters'!$C$10","v":40},{"$f":"B74*'User Parameters'!$C$14","v":0},46.361466860930307,0.10199568206208232,0.81000392539810695,{"$f":"IF(UP_RSBasis=\"MLR\",UP_RSTarget_MLR,IF(UP_RSBasis=\"Medical Baseline\",UP_RSTarget_Medlcal,0))","v":0},0,0,0,0,0,0,0,"",0,{"$f":"(S74+C74+'User Parameters'!$C$11)/(B74-F74)","v":0.81000392539810695},{"$f":"IF(T74<'User Parameters'!$J$5,'User Parameters'!$J$5,IF(T74>'User Parameters'!$J$6,'User Parameters'!$J$6,T74))","v":0.81000392539810695},0,0,{"$f":"(B74-C74-F74-E74-S74-V74)/'Results Dashboard'!$D$42","v":0.10199568206208232},{"$f":"IF((X74+W74)>0,(X74+W74)*0.5*((1+'User Parameters'!C$48)^((12+UP_COC_WithholdLag)/12)-1),(X74+W74)*0.5*((1+'User Parameters'!$C$49)^((12+UP_COC_WithholdLag)/12)-1))","v":0},{"$f":"-'User Parameters'!$C$12*('User Parameters'!$C$13-1)","v":0},0.10199568206208232,0.98320750784790756,7.4420526356261396E-3,{"$f":"AC74","v":7.4420526356261396E-3},{"$f":"IF($AA74<-'Results Dashboard'!$J$7,$AA74+'Results Dashboard'!$J$7,0)","v":0},{"$f":"IF($AA74<-'Results Dashboard'!$J$8,$AA74+'Results Dashboard'!$J$8,0)","v":0},{"$f":"IF($AA74<-'Results Dashboard'!$J$9,$AA74+'Results Dashboard'!$J$9,0)","v":0},{"$f":"IF($AA74<-'Results Dashboard'!$J$11,$AA74+'Results Dashboard'!$J$11,0)","v":0},{"$f":"IF($AA74<-'Results Dashboard'!$J$10,$AA74+'Results Dashboard'!$J$10,0)","v":0},null,{"$f":"IF((X74+W74)>0,(X74+W74)*0.5*'User Parameters'!C$48,(X74+W74)*0.5*'User Parameters'!$C$49)","v":0},{"$f":"-'User Parameters'!$C$12*('User Parameters'!$C$13-1)","v":0},0.10199568206208232]
[0.81500392539810695,454.54342697283204,370.45467724676587,0.81500392539810695,{"$f":"'User Parameters'!$C$10","v":40},{"$f":"B75*'User Parameters'!$C$14","v":0},44.088749726066169,9.6995682062082367E-2,0.81500392539810695,{"$f":"IF(UP_RSBasis=\"MLR\",UP_RSTarget_MLR,IF(UP_RSBasis=\"Medical Baseline\",UP_RSTarget_Medlcal,0))","v":0},0,0,0,0,0,0,0,"",0,{"$f":"(S75+C75+'User Parameters'!$C$11)/(B75-F75)","v":0.81500392539810695},{"$f":"IF(T75<'User Parameters'!$J$5,'User Parameters'!$J$5,IF(T75>'User Parameters'!$J$6,'User Parameters'!$J$6,T75))","v":0.81500392539810695},0,0,{"$f":"(B75-C75-F75-E75-S75-V75)/'Results Dashboard'!$D$42","v":9.6995682062082367E-2},{"$f":"IF((X75+W75)>0,(X75+W75)*0.5*((1+'User Parameters'!C$48)^((12+UP_COC_WithholdLag)/12)-1),(X75+W75)*0.5*((1+'User Parameters'!$C$49)^((12+UP_COC_WithholdLag)/12)-1))","v":0},{"$f":"-'User Parameters'!$C$12*('User Parameters'!$C$13-1)","v":0},9.6995682062082367E-2,0.97576545521228142,1.0035052344678497E-2,1.0035052344678497E-2,{"$f":"IF($AA75<-'Results Dashboard'!$J$7,$AA75+'Results Dashboard'!$J$7,0)","v":0},{"$f":"IF($AA75<-'Results Dashboard'!$J$8,$AA75+'Results Dashboard'!$J$8,0)","v":0},{"$f":"IF($AA75<-'Results Dashboard'!$J$9,$AA75+'Results Dashboard'!$J$9,0)","v":0},{"$f":"IF($AA75<-'Results Dashboard'!$J$11,$AA75+'Results Dashboard'!$J$11,0)","v":0},{"$f":"IF($AA75<-'Results Dashboard'!$J$10,$AA75+'Results Dashboard'!$J$10,0)","v":0},null,{"$f":"IF((X75+W75)>0,(X75+W75)*0.5*'User Parameters'!C$48,(X75+W75)*0.5*'User Parameters'!$C$49)","v":0},{"$f":"-'User Parameters'!$C$12*('User Parameters'!$C$13-1)","v":0},9.6995682062082367E-2]
[0.82000392539810696,454.54342697283204,372.72739438163006,0.82000392539810696,{"$f":"'User Parameters'!$C$10","v":40},{"$f":"B76*'User Parameters'!$C$14","v":0},41.816032591201974,9.1995682062082293E-2,0.82000392539810696,{"$f":"IF(UP_RSBasis=\"MLR\",UP_RSTarget_MLR,IF(UP_RSBasis=\"Medical Baseline\",UP_RSTarget_Medlcal,0))","v":0},0,0,0,0,0,0,0,"",0,{"$f":"(S76+C76+'User Parameters'!$C$11)/(B76-F76)","v":0.82000392539810696},{"$f":"IF(T76<'User Parameters'!$J$5,'User Parameters'!$J$5,IF(T76>'User Parameters'!$J$6,'User Parameters'!$J$6,T76))","v":0.82000392539810696},0,0,{"$f":"(B76-C76-F76-E76-S76-V76)/'Results Dashboard'!$D$42","v":9.1995682062082293E-2},{"$f":"IF((X76+W76)>0,(X76+W76)*0.5*((1+'User Parameters'!C$48)^((12+UP_COC_WithholdLag)/12)-1),(X76+W76)*0.5*((1+'User Parameters'!$C$49)^((12+UP_COC_WithholdLag)/12)-1))","v":0},{"$f":"-'User Parameters'!$C$12*('User Parameters'!$C$13-1)","v":0},9.1995682062082293E-2,0.96573040286760292,1.3223907763341813E-2,1.3223907763341813E-2,{"$f":"IF($AA76<-'Results Dashboard'!$J$7,$AA76+'Results Dashboard'!$J$7,0)","v":0},{"$f":"IF($AA76<-'Results Dashboard'!$J$8,$AA76+'Results Dashboard'!$J$8,0)","v":0},{"$f":"IF($AA76<-'Results Dashboard'!$J$9,$AA76+'Results Dashboard'!$J$9,0)","v":0},{"$f":"IF($AA76<-'Results Dashboard'!$J$11,$AA76+'Results Dashboard'!$J$11,0)","v":0},{"$f":"IF($AA76<-'Results Dashboard'!$J$10,$AA76+'Results Dashboard'!$J$10,0)","v":0},null,{"$f":"IF((X76+W76)>0,(X76+W76)*0.5*'User Parameters'!C$48,(X76+W76)*0.5*'User Parameters'!$C$49)","v":0},{"$f":"-'User Parameters'!$C$12*('User Parameters'!$C$13-1)","v":0},9.1995682062082293E-2]
[0.82500392539810696,454.54342697283204,375.0001115164942,0.82500392539810696,{"$f":"'User Parameters'!$C$10","v":40},{"$f":"B77*'User Parameters'!$C$14","v":0},{"$f":"B77-E77-C77-F77","v":39.543315456337837},8.699568206208233E-2,0.82500392539810696,{"$f":"IF(UP_RSBasis=\"MLR\",UP_RSTarget_MLR,IF(UP_RSBasis=\"Medical Baseline\",UP_RSTarget_Medlcal,0))","v":0},0,0,0,0,0,0,0,"",0,{"$f":"(S77+C77+'User Parameters'!$C$11)/(B77-F77)","v":0.82500392539810696},{"$f":"IF(T77<'User Parameters'!$J$5,'User Parameters'!$J$5,IF(T77>'User Parameters'!$J$6,'User Parameters'!$J$6,T77))","v":0.82500392539810696},0,0,{"$f":"(B77-C77-F77-E77-S77-V77)/'Results Dashboard'!$D$42","v":8.699568206208233E-2},{"$f":"IF((X77+W77)>0,(X77+W77)*0.5*((1+'User Parameters'!C$48)^((12+UP_COC_WithholdLag)/12)-1),(X77+W77)*0.5*((1+'User Parameters'!$C$49)^((12+UP_COC_WithholdLag)/12)-1))","v":0},{"$f":"-'User Parameters'!$C$12*('User Parameters'!$C$13-1)","v":0},8.699568206208233E-2,0.95250649510426111,1.7029945457463613E-2,1.7029945457463613E-2,{"$f":"IF($AA77<-'Results Dashboard'!$J$7,$AA77+'Results Dashboard'!$J$7,0)","v":0},{"$f":"IF($AA77<-'Results Dashboard'!$J$8,$AA77+'Results Dashboard'!$J$8,0)","v":0},{"$f":"IF($AA77<-'Results Dashboard'!$J$9,$AA77+'Results Dashboard'!$J$9,0)","v":0},{"$f":"IF($AA77<-'Results Dashboard'!$J$11,$AA77+'Results Dashboard'!$J$11,0)","v":0},{"$f":"IF($AA77<-'Results Dashboard'!$J$10,$AA77+'Results Dashboard'!$J$10,0)","v":0},null,{"$f":"IF((X77+W77)>0,(X77+W77)*0.5*'User Parameters'!C$48,(X77+W77)*0.5*'User Parameters'!$C$49)","v":0},{"$f":"-'User Parameters'!$C$12*('User Parameters'!$C$13-1)","v":0},8.699568206208233E-2]
[0.83000392539810697,454.54342697283204,377.27282865135834,0.83000392539810686,{"$f":"'User Parameters'!$C$10","v":40},{"$f":"B78*'User Parameters'!$C$14","v":0},37.270598321473699,8.1995682062082381E-2,0.83000392539810686,{"$f":"IF(UP_RSBasis=\"MLR\",UP_RSTarget_MLR,IF(UP_RSBasis=\"Medical Baseline\",UP_RSTarget_Medlcal,0))","v":0},0,0,0,0,0,0,0,"",0,{"$f":"(S78+C78+'User Parameters'!$C$11)/(B78-F78)","v":0.83000392539810686},{"$f":"IF(T78<'User Parameters'!$J$5,'User Parameters'!$J$5,IF(T78>'User Parameters'!$J$6,'User Parameters'!$J$6,T78))","v":0.83000392539810686},0,0,{"$f":"(B78-C78-F78-E78-S78-V78)/'Results Dashboard'!$D$42","v":8.1995682062082381E-2},{"$f":"IF((X78+W78)>0,(X78+W78)*0.5*((1+'User Parameters'!C$48)^((12+UP_COC_WithholdLag)/12)-1),(X78+W78)*0.5*((1+'User Parameters'!$C$49)^((12+UP_COC_WithholdLag)/12)-1))","v":0},{"$f":"-'User Parameters'!$C$12*('User Parameters'!$C$13-1)","v":0},8.1995682062082381E-2,0.9354765496467975,2.143285324638744E-2,2.143285324638744E-2,{"$f":"IF($AA78<-'Results Dashboard'!$J$7,$AA78+'Results Dashboard'!$J$7,0)","v":0},{"$f":"IF($AA78<-'Results Dashboard'!$J$8,$AA78+'Results Dashboard'!$J$8,0)","v":0},{"$f":"IF($AA78<-'Results Dashboard'!$J$9,$AA78+'Results Dashboard'!$J$9,0)","v":0},{"$f":"IF($AA78<-'Results Dashboard'!$J$11,$AA78+'Results Dashboard'!$J$11,0)","v":0},{"$f":"IF($AA78<-'Results Dashboard'!$J$10,$AA78+'Results Dashboard'!$J$10,0)","v":0},null,{"$f":"IF((X78+W78)>0,(X78+W78)*0.5*'User Parameters'!C$48,(X78+W78)*0.5*'User Parameters'!$C$49)","v":0},{"$f":"-'User Parameters'!$C$12*('User Parameters'!$C$13-1)","v":0},8.1995682062082381E-2]
[0.83500392539810697,454.54342697283204,379.54554578622253,0.83500392539810697,{"$f":"'User Parameters'!$C$10","v":40},{"$f":"B79*'User Parameters'!$C$14","v":0},34.997881186609504,7.6995682062082307E-2,0.83500392539810697,{"$f":"IF(UP_RSBasis=\"MLR\",UP_RSTarget_MLR,IF(UP_RSBasis=\"Medical Baseline\",UP_RSTarget_Medlcal,0))","v":0},0,0,0,0,0,0,0,"",0,{"$f":"(S79+C79+'User Parameters'!$C$11)/(B79-F79)","v":0.83500392539810697},{"$f":"IF(T79<'User Parameters'!$J$5,'User Parameters'!$J$5,IF(T79>'User Parameters'!$J$6,'User Parameters'!$J$6,T79))","v":0.83500392539810697},0,0,{"$f":"(B79-C79-F79-E79-S79-V79)/'Results Dashboard'!$D$42","v":7.6995682062082307E-2},{"$f":"IF((X79+W79)>0,(X79+W79)*0.5*((1+'User Parameters'!C$48)^((12+UP_COC_WithholdLag)/12)-1),(X79+W79)*0.5*((1+'User Parameters'!$C$49)^((12+UP_COC_WithholdLag)/12)-1))","v":0},{"$f":"-'User Parameters'!$C$12*('User Parameters'!$C$13-1)","v":0},7.6995682062082307E-2,0.91404369640041006,2.6360887112464981E-2,2.6360887112464981E-2,{"$f":"IF($AA79<-'Results Dashboard'!$J$7,$AA79+'Results Dashboard'!$J$7,0)","v":0},{"$f":"IF($AA79<-'Results Dashboard'!$J$8,$AA79+'Results Dashboard'!$J$8,0)","v":0},{"$f":"IF($AA79<-'Results Dashboard'!$J$9,$AA79+'Results Dashboard'!$J$9,0)","v":0},{"$f":"IF($AA79<-'Results Dashboard'!$J$11,$AA79+'Results Dashboard'!$J$11,0)","v":0},{"$f":"IF($AA79<-'Results Dashboard'!$J$10,$AA79+'Results Dashboard'!$J$10,0)","v":0},null,{"$f":"IF((X79+W79)>0,(X79+W79)*0.5*'User Parameters'!C$48,(X79+W79)*0.5*'User Parameters'!$C$49)","v":0},{"$f":"-'User Parameters'!$C$12*('User Parameters'!$C$13-1)","v":0},7.6995682062082307E-2]
[0.84000392539810698,454.54342697283204,381.81826292108667,0.84000392539810698,{"$f":"'User Parameters'!$C$10","v":40},{"$f":"B80*'User Parameters'!$C$14","v":0},32.725164051745367,7.1995682062082358E-2,0.84000392539810698,{"$f":"IF(UP_RSBasis=\"MLR\",UP_RSTarget_MLR,IF(UP_RSBasis=\"Medical Baseline\",UP_RSTarget_Medlcal,0))","v":0},0,0,0,0,0,0,0,"",0,{"$f":"(S80+C80+'User Parameters'!$C$11)/(B80-F80)","v":0.84000392539810698},{"$f":"IF(T80<'User Parameters'!$J$5,'User Parameters'!$J$5,IF(T80>'User Parameters'!$J$6,'User Parameters'!$J$6,T80))","v":0.84000392539810698},0,0,{"$f":"(B80-C80-F80-E80-S80-V80)/'Results Dashboard'!$D$42","v":7.1995682062082358E-2},{"$f":"IF((X80+W80)>0,(X80+W80)*0.5*((1+'User Parameters'!C$48)^((12+UP_COC_WithholdLag)/12)-1),(X80+W80)*0.5*((1+'User Parameters'!$C$49)^((12+UP_COC_WithholdLag)/12)-1))","v":0},{"$f":"-'User Parameters'!$C$12*('User Parameters'!$C$13-1)","v":0},7.1995682062082358E-2,0.88768280928794507,3.1684974298753166E-2,3.1684974298753166E-2,{"$f":"IF($AA80<-'Results Dashboard'!$J$7,$AA80+'Results Dashboard'!$J$7,0)","v":0},{"$f":"IF($AA80<-'Results Dashboard'!$J$8,$AA80+'Results Dashboard'!$J$8,0)","v":0},{"$f":"IF($AA80<-'Results Dashboard'!$J$9,$AA80+'Results Dashboard'!$J$9,0)","v":0},{"$f":"IF($AA80<-'Results Dashboard'!$J$11,$AA80+'Results Dashboard'!$J$11,0)","v":0},{"$f":"IF($AA80<-'Results Dashboard'!$J$10,$AA80+'Results Dashboard'!$J$10,0)","v":0},null,{"$f":"IF((X80+W80)>0,(X80+W80)*0.5*'User Parameters'!C$48,(X80+W80)*0.5*'User Parameters'!$C$49)","v":0},{"$f":"-'User Parameters'!$C$12*('User Parameters'!$C$13-1)","v":0},7.1995682062082358E-2]
[0.84500392539810698,454.54342697283204,384.09098005595087,0.84500392539810698,{"$f":"'User Parameters'!$C$10","v":40},{"$f":"B81*'User Parameters'!$C$14","v":0},30.452446916881172,6.6995682062082285E-2,0.84500392539810698,{"$f":"IF(UP_RSBasis=\"MLR\",UP_RSTarget_MLR,IF(UP_RSBasis=\"Medical Baseline\",UP_RSTarget_Medlcal,0))","v":0},0,0,0,0,0,0,0,"",0,{"$f":"(S81+C81+'User Parameters'!$C$11)/(B81-F81)","v":0.84500392539810698},{"$f":"IF(T81<'User Parameters'!$J$5,'User Parameters'!$J$5,IF(T81>'User Parameters'!$J$6,'User Parameters'!$J$6,T81))","v":0.84500392539810698},0,0,{"$f":"(B81-C81-F81-E81-S81-V81)/'Results Dashboard'!$D$42","v":6.6995682062082285E-2},{"$f":"IF((X81+W81)>0,(X81+W81)*0.5*((1+'User Parameters'!C$48)^((12+UP_COC_WithholdLag)/12)-1),(X81+W81)*0.5*((1+'User Parameters'!$C$49)^((12+UP_COC_WithholdLag)/12)-1))","v":0},{"$f":"-'User Parameters'!$C$12*('User Parameters'!$C$13-1)","v":0},6.6995682062082285E-2,0.85599783498919191,3.7218598216660626E-2,3.7218598216660626E-2,{"$f":"IF($AA81<-'Results Dashboard'!$J$7,$AA81+'Results Dashboard'!$J$7,0)","v":0},{"$f":"IF($AA81<-'Results Dashboard'!$J$8,$AA81+'Results Dashboard'!$J$8,0)","v":0},{"$f":"IF($AA81<-'Results Dashboard'!$J$9,$AA81+'Results Dashboard'!$J$9,0)","v":0},{"$f":"IF($AA81<-'Results Dashboard'!$J$11,$AA81+'Results Dashboard'!$J$11,0)","v":0},{"$f":"IF($AA81<-'Results Dashboard'!$J$10,$AA81+'Results Dashboard'!$J$10,0)","v":0},null,{"$f":"IF((X81+W81)>0,(X81+W81)*0.5*'User Parameters'!C$48,(X81+W81)*0.5*'User Parameters'!$C$49)","v":0},{"$f":"-'User Parameters'!$C$12*('User Parameters'!$C$13-1)","v":0},6.6995682062082285E-2]
[0.85000392539810699,454.54342697283204,386.363697190815,0.85000392539810699,{"$f":"'User Parameters'!$C$10","v":40},{"$f":"B82*'User Parameters'!$C$14","v":0},28.179729782017034,6.1995682062082336E-2,0.85000392539810699,{"$f":"IF(UP_RSBasis=\"MLR\",UP_RSTarget_MLR,IF(UP_RSBasis=\"Medical Baseline\",UP_RSTarget_Medlcal,0))","v":0},0,0,0,0,0,0,0,"",0,{"$f":"(S82+C82+'User Parameters'!$C$11)/(B82-F82)","v":0.85000392539810699},{"$f":"IF(T82<'User Parameters'!$J$5,'User Parameters'!$J$5,IF(T82>'User Parameters'!$J$6,'User Parameters'!$J$6,T82))","v":0.85000392539810699},0,0,{"$f":"(B82-C82-F82-E82-S82-V82)/'Results Dashboard'!$D$42","v":6.1995682062082336E-2},{"$f":"IF((X82+W82)>0,(X82+W82)*0.5*((1+'User Parameters'!C$48)^((12+UP_COC_WithholdLag)/12)-1),(X82+W82)*0.5*((1+'User Parameters'!$C$49)^((12+UP_COC_WithholdLag)/12)-1))","v":0},{"$f":"-'User Parameters'!$C$12*('User Parameters'!$C$13-1)","v":0},6.1995682062082336E-2,0.81877923677253128,4.2724794942053834E-2,4.2724794942053834E-2,{"$f":"IF($AA82<-'Results Dashboard'!$J$7,$AA82+'Results Dashboard'!$J$7,0)","v":0},{"$f":"IF($AA82<-'Results Dashboard'!$J$8,$AA82+'Results Dashboard'!$J$8,0)","v":0},{"$f":"IF($AA82<-'Results Dashboard'!$J$9,$AA82+'Results Dashboard'!$J$9,0)","v":0},{"$f":"IF($AA82<-'Results Dashboard'!$J$11,$AA82+'Results Dashboard'!$J$11,0)","v":0},{"$f":"IF($AA82<-'Results Dashboard'!$J$10,$AA82+'Results Dashboard'!$J$10,0)","v":0},null,{"$f":"IF((X82+W82)>0,(X82+W82)*0.5*'User Parameters'!C$48,(X82+W82)*0.5*'User Parameters'!$C$49)","v":0},{"$f":"-'User Parameters'!$C$12*('User Parameters'!$C$13-1)","v":0},6.1995682062082336E-2]
[0.85500392539810699,454.54342697283204,388.6364143256792,0.85500392539810699,{"$f":"'User Parameters'!$C$10","v":40},{"$f":"B83*'User Parameters'!$C$14","v":0},25.90701264715284,5.6995682062082255E-2,0.85500392539810699,{"$f":"IF(UP_RSBasis=\"MLR\",UP_RSTarget_MLR,IF(UP_RSBasis=\"Medical Baseline\",UP_RSTarget_Medlcal,0))","v":0},0,0,0,0,0,0,0,"",0,{"$f":"(S83+C83+'User Parameters'!$C$11)/(B83-F83)","v":0.85500392539810699},{"$f":"IF(T83<'User Parameters'!$J$5,'User Parameters'!$J$5,IF(T83>'User Parameters'!$J$6,'User Parameters'!$J$6,T83))","v":0.85500392539810699},0,0,{"$f":"(B83-C83-F83-E83-S83-V83)/'Results Dashboard'!$D$42","v":5.6995682062082255E-2},{"$f":"IF((X83+W83)>0,(X83+W83)*0.5*((1+'User Parameters'!C$48)^((12+UP_COC_WithholdLag)/12)-1),(X83+W83)*0.5*((1+'User Parameters'!$C$49)^((12+UP_COC_WithholdLag)/12)-1))","v":0},{"$f":"-'User Parameters'!$C$12*('User Parameters'!$C$13-1)","v":0},5.6995682062082255E-2,0.77605444183047745,4.7930646857709758E-2,4.7930646857709758E-2,{"$f":"IF($AA83<-'Results Dashboard'!$J$7,$AA83+'Results Dashboard'!$J$7,0)","v":0},{"$f":"IF($AA83<-'Results Dashboard'!$J$8,$AA83+'Results Dashboard'!$J$8,0)","v":0},{"$f":"IF($AA83<-'Results Dashboard'!$J$9,$AA83+'Results Dashboard'!$J$9,0)","v":0},{"$f":"IF($AA83<-'Results Dashboard'!$J$11,$AA83+'Results Dashboard'!$J$11,0)","v":0},{"$f":"IF($AA83<-'Results Dashboard'!$J$10,$AA83+'Results Dashboard'!$J$10,0)","v":0},null,{"$f":"IF((X83+W83)>0,(X83+W83)*0.5*'User Parameters'!C$48,(X83+W83)*0.5*'User Parameters'!$C$49)","v":0},{"$f":"-'User Parameters'!$C$12*('User Parameters'!$C$13-1)","v":0},5.6995682062082255E-2]
[0.86000392539810699,454.54342697283204,390.90913146054334,0.86000392539810699,{"$f":"'User Parameters'!$C$10","v":40},{"$f":"B84*'User Parameters'!$C$14","v":0},23.634295512288702,5.1995682062082306E-2,0.86000392539810699,{"$f":"IF(UP_RSBasis=\"MLR\",UP_RSTarget_MLR,IF(UP_RSBasis=\"Medical Baseline\",UP_RSTarget_Medlcal,0))","v":0},0,0,0,0,0,0,0,"",0,{"$f":"(S84+C84+'User Parameters'!$C$11)/(B84-F84)","v":0.86000392539810699},{"$f":"IF(T84<'User Parameters'!$J$5,'User Parameters'!$J$5,IF(T84>'User Parameters'!$J$6,'User Parameters'!$J$6,T84))","v":0.86000392539810699},0,0,{"$f":"(B84-C84-F84-E84-S84-V84)/'Results Dashboard'!$D$42","v":5.1995682062082306E-2},{"$f":"IF((X84+W84)>0,(X84+W84)*0.5*((1+'User Parameters'!C$48)^((12+UP_COC_WithholdLag)/12)-1),(X84+W84)*0.5*((1+'User Parameters'!$C$49)^((12+UP_COC_WithholdLag)/12)-1))","v":0},{"$f":"-'User Parameters'!$C$12*('User Parameters'!$C$13-1)","v":0},5.1995682062082306E-2,0.72812379497276769,5.2548451960653386E-2,5.2548451960653386E-2,{"$f":"IF($AA84<-'Results Dashboard'!$J$7,$AA84+'Results Dashboard'!$J$7,0)","v":0},{"$f":"IF($AA84<-'Results Dashboard'!$J$8,$AA84+'Results Dashboard'!$J$8,0)","v":0},{"$f":"IF($AA84<-'Results Dashboard'!$J$9,$AA84+'Results Dashboard'!$J$9,0)","v":0},{"$f":"IF($AA84<-'Results Dashboard'!$J$11,$AA84+'Results Dashboard'!$J$11,0)","v":0},{"$f":"IF($AA84<-'Results Dashboard'!$J$10,$AA84+'Results Dashboard'!$J$10,0)","v":0},null,{"$f":"IF((X84+W84)>0,(X84+W84)*0.5*'User Parameters'!C$48,(X84+W84)*0.5*'User Parameters'!$C$49)","v":0},{"$f":"-'User Parameters'!$C$12*('User Parameters'!$C$13-1)","v":0},5.1995682062082306E-2]
[0.865003925398107,454.54342697283204,393.18184859540747,0.86500392539810689,{"$f":"'User Parameters'!$C$10","v":40},{"$f":"B85*'User Parameters'!$C$14","v":0},21.361578377424564,4.6995682062082357E-2,0.86500392539810689,{"$f":"IF(UP_RSBasis=\"MLR\",UP_RSTarget_MLR,IF(UP_RSBasis=\"Medical Baseline\",UP_RSTarget_Medlcal,0))","v":0},0,0,0,0,0,0,0,"",0,{"$f":"(S85+C85+'User Parameters'!$C$11)/(B85-F85)","v":0.86500392539810689},{"$f":"IF(T85<'User Parameters'!$J$5,'User Parameters'!$J$5,IF(T85>'User Parameters'!$J$6,'User Parameters'!$J$6,T85))","v":0.86500392539810689},0,0,{"$f":"(B85-C85-F85-E85-S85-V85)/'Results Dashboard'!$D$42","v":4.6995682062082357E-2},{"$f":"IF((X85+W85)>0,(X85+W85)*0.5*((1+'User Parameters'!C$48)^((12+UP_COC_WithholdLag)/12)-1),(X85+W85)*0.5*((1+'User Parameters'!$C$49)^((12+UP_COC_WithholdLag)/12)-1))","v":0},{"$f":"-'User Parameters'!$C$12*('User Parameters'!$C$13-1)","v":0},4.6995682062082357E-2,0.6755753430121143,5.6301491534868964E-2,5.6301491534868964E-2,{"$f":"IF($AA85<-'Results Dashboard'!$J$7,$AA85+'Results Dashboard'!$J$7,0)","v":0},{"$f":"IF($AA85<-'Results Dashboard'!$J$8,$AA85+'Results Dashboard'!$J$8,0)","v":0},{"$f":"IF($AA85<-'Results Dashboard'!$J$9,$AA85+'Results Dashboard'!$J$9,0)","v":0},{"$f":"IF($AA85<-'Results Dashboard'!$J$11,$AA85+'Results Dashboard'!$J$11,0)","v":0},{"$f":"IF($AA85<-'Results Dashboard'!$J$10,$AA85+'Results Dashboard'!$J$10,0)","v":0},null,{"$f":"IF((X85+W85)>0,(X85+W85)*0.5*'User Parameters'!C$48,(X85+W85)*0.5*'User Parameters'!$C$49)","v":0},{"$f":"-'User Parameters'!$C$12*('User Parameters'!$C$13-1)","v":0},4.6995682062082357E-2]
[0.870003925398107,454.54342697283204,395.45456573027167,0.870003925398107,{"$f":"'User Parameters'!$C$10","v":40},{"$f":"B86*'User Parameters'!$C$14","v":0},19.08886124256037,4.1995682062082283E-2,0.870003925398107,{"$f":"IF(UP_RSBasis=\"MLR\",UP_RSTarget_MLR,IF(UP_RSBasis=\"Medical Baseline\",UP_RSTarget_Medlcal,0))","v":0},0,0,0,0,0,0,0,"",0,{"$f":"(S86+C86+'User Parameters'!$C$11)/(B86-F86)","v":0.870003925398107},{"$f":"IF(T86<'User Parameters'!$J$5,'User Parameters'!$J$5,IF(T86>'User Parameters'!$J$6,'User Parameters'!$J$6,T86))","v":0.870003925398107},0,0,{"$f":"(B86-C86-F86-E86-S86-V86)/'Results Dashboard'!$D$42","v":4.1995682062082283E-2},{"$f":"IF((X86+W86)>0,(X86+W86)*0.5*((1+'User Parameters'!C$48)^((12+UP_COC_WithholdLag)/12)-1),(X86+W86)*0.5*((1+'User Parameters'!$C$49)^((12+UP_COC_WithholdLag)/12)-1))","v":0},{"$f":"-'User Parameters'!$C$12*('User Parameters'!$C$13-1)","v":0},4.1995682062082283E-2,0.61927385147724534,5.8951276624834459E-2,5.8951276624834459E-2,{"$f":"IF($AA86<-'Results Dashboard'!$J$7,$AA86+'Results Dashboard'!$J$7,0)","v":0},{"$f":"IF($AA86<-'Results Dashboard'!$J$8,$AA86+'Results Dashboard'!$J$8,0)","v":0},{"$f":"IF($AA86<-'Results Dashboard'!$J$9,$AA86+'Results Dashboard'!$J$9,0)","v":0},{"$f":"IF($AA86<-'Results Dashboard'!$J$11,$AA86+'Results Dashboard'!$J$11,0)","v":0},{"$f":"IF($AA86<-'Results Dashboard'!$J$10,$AA86+'Results Dashboard'!$J$10,0)","v":0},null,{"$f":"IF((X86+W86)>0,(X86+W86)*0.5*'User Parameters'!C$48,(X86+W86)*0.5*'User Parameters'!$C$49)","v":0},{"$f":"-'User Parameters'!$C$12*('User Parameters'!$C$13-1)","v":0},4.1995682062082283E-2]
[{"$f":"A88-0.005","v":0.87500392539810701},454.54342697283204,397.72728286513581,0.87500392539810701,{"$f":"'User Parameters'!$C$10","v":40},{"$f":"B87*'User Parameters'!$C$14","v":0},16.816144107696232,3.6995682062082327E-2,0.87500392539810701,{"$f":"IF(UP_RSBasis=\"MLR\",UP_RSTarget_MLR,IF(UP_RSBasis=\"Medical Baseline\",UP_RSTarget_Medlcal,0))","v":0},0,0,0,0,0,0,0,"",0,{"$f":"(S87+C87+'User Parameters'!$C$11)/(B87-F87)","v":0.87500392539810701},{"$f":"IF(T87<'User Parameters'!$J$5,'User Parameters'!$J$5,IF(T87>'User Parameters'!$J$6,'User Parameters'!$J$6,T87))","v":0.87500392539810701},0,0,{"$f":"(B87-C87-F87-E87-S87-V87)/'Results Dashboard'!$D$42","v":3.6995682062082327E-2},{"$f":"IF((X87+W87)>0,(X87+W87)*0.5*((1+'User Parameters'!C$48)^((12+UP_COC_WithholdLag)/12)-1),(X87+W87)*0.5*((1+'User Parameters'!$C$49)^((12+UP_COC_WithholdLag)/12)-1))","v":0},{"$f":"-'User Parameters'!$C$12*('User Parameters'!$C$13-1)","v":0},3.6995682062082327E-2,0.56032257485241088,6.0322574852410882E-2,6.0322574852410882E-2,{"$f":"IF($AA87<-'Results Dashboard'!$J$7,$AA87+'Results Dashboard'!$J$7,0)","v":0},{"$f":"IF($AA87<-'Results Dashboard'!$J$8,$AA87+'Results Dashboard'!$J$8,0)","v":0},{"$f":"IF($AA87<-'Results Dashboard'!$J$9,$AA87+'Results Dashboard'!$J$9,0)","v":0},{"$f":"IF($AA87<-'Results Dashboard'!$J$11,$AA87+'Results Dashboard'!$J$11,0)","v":0},{"$f":"IF($AA87<-'Results Dashboard'!$J$10,$AA87+'Results Dashboard'!$J$10,0)","v":0},null,{"$f":"IF((X87+W87)>0,(X87+W87)*0.5*'User Parameters'!C$48,(X87+W87)*0.5*'User Parameters'!$C$49)","v":0},{"$f":"-'User Parameters'!$C$12*('User Parameters'!$C$13-1)","v":0},3.6995682062082327E-2]
[{"$f":"'Results Dashboard'!D32/Results_Premium","v":0.88000392539810701},{"$f":"C88/A88","v":454.54342697283204},{"$f":"'User Parameters'!C9","v":400},0.88000392539810701,{"$f":"'User Parameters'!$C$10","v":40},{"$f":"B88*'User Parameters'!$C$14","v":0},14.543426972832037,3.1995682062082254E-2,0.88000392539810701,{"$f":"IF(UP_RSBasis=\"MLR\",UP_RSTarget_MLR,IF(UP_RSBasis=\"Medical Baseline\",UP_RSTarget_Medlcal,0))","v":0},0,0,0,0,0,0,0,"",0,{"$f":"(S88+C88+'User Parameters'!$C$11)/(B88-F88)","v":0.88000392539810701},{"$f":"IF(T88<'User Parameters'!$J$5,'User Parameters'!$J$5,IF(T88>'User Parameters'!$J$6,'User Parameters'!$J$6,T88))","v":0.88000392539810701},0,0,{"$f":"(B88-C88-F88-E88-S88-V88)/'Results Dashboard'!$D$42","v":3.1995682062082254E-2},{"$f":"IF((X88+W88)>0,(X88+W88)*0.5*((1+'User Parameters'!C$48)^((12+UP_COC_WithholdLag)/12)-1),(X88+W88)*0.5*((1+'User Parameters'!$C$49)^((12+UP_COC_WithholdLag)/12)-1))","v":0},{"$f":"-'User Parameters'!$C$12*('User Parameters'!$C$13-1)","v":0},3.1995682062082254E-2,0.5,0,0,{"$f":"IF($AA88<-'Results Dashboard'!$J$7,$AA88+'Results Dashboard'!$J$7,0)","v":0},{"$f":"IF($AA88<-'Results Dashboard'!$J$8,$AA88+'Results Dashboard'!$J$8,0)","v":0},{"$f":"IF($AA88<-'Results Dashboard'!$J$9,$AA88+'Results Dashboard'!$J$9,0)","v":0},{"$f":"IF($AA88<-'Results Dashboard'!$J$11,$AA88+'Results Dashboard'!$J$11,0)","v":0},{"$f":"IF($AA88<-'Results Dashboard'!$J$10,$AA88+'Results Dashboard'!$J$10,0)","v":0},null,{"$f":"IF((X88+W88)>0,(X88+W88)*0.5*'User Parameters'!C$48,(X88+W88)*0.5*'User Parameters'!$C$49)","v":0},{"$f":"-'User Parameters'!$C$12*('User Parameters'!$C$13-1)","v":0},3.1995682062082254E-2]
[{"$f":"A88+0.005","v":0.88500392539810702},{"$f":"$B$88","v":454.54342697283204},402.27271713486414,0.88500392539810702,{"$f":"'User Parameters'!$C$10","v":40},{"$f":"B89*'User Parameters'!$C$14","v":0},12.2707098379679,2.6995682062082305E-2,0.88500392539810702,{"$f":"IF(UP_RSBasis=\"MLR\",UP_RSTarget_MLR,IF(UP_RSBasis=\"Medical Baseline\",UP_RSTarget_Medlcal,0))","v":0},0,0,0,0,0,0,0,"",0,{"$f":"(S89+C89+'User Parameters'!$C$11)/(B89-F89)","v":0.88500392539810702},{"$f":"IF(T89<'User Parameters'!$J$5,'User Parameters'!$J$5,IF(T89>'User Parameters'!$J$6,'User Parameters'!$J$6,T89))","v":0.88500392539810702},0,0,{"$f":"(B89-C89-F89-E89-S89-V89)/'Results Dashboard'!$D$42","v":2.6995682062082305E-2},{"$f":"IF((X89+W89)>0,(X89+W89)*0.5*((1+'User Parameters'!C$48)^((12+UP_COC_WithholdLag)/12)-1),(X89+W89)*0.5*((1+'User Parameters'!$C$49)^((12+UP_COC_WithholdLag)/12)-1))","v":0},{"$f":"-'User Parameters'!$C$12*('User Parameters'!$C$13-1)","v":0},2.6995682062082305E-2,0.43967742514759067,{"$f":"AB88-AB89","v":6.0322574852409327E-2},6.0322574852409327E-2,{"$f":"IF($AA89<-'Results Dashboard'!$J$7,$AA89+'Results Dashboard'!$J$7,0)","v":0},{"$f":"IF($AA89<-'Results Dashboard'!$J$8,$AA89+'Results Dashboard'!$J$8,0)","v":0},{"$f":"IF($AA89<-'Results Dashboard'!$J$9,$AA89+'Results Dashboard'!$J$9,0)","v":0},{"$f":"IF($AA89<-'Results Dashboard'!$J$11,$AA89+'Results Dashboard'!$J$11,0)","v":0},{"$f":"IF($AA89<-'Results Dashboard'!$J$10,$AA89+'Results Dashboard'!$J$10,0)","v":0},null,{"$f":"IF((X89+W89)>0,(X89+W89)*0.5*'User Parameters'!C$48,(X89+W89)*0.5*'User Parameters'!$C$49)","v":0},{"$f":"-'User Parameters'!$C$12*('User Parameters'!$C$13-1)","v":0},2.6995682062082305E-2]
[{"$f":"A89+0.005","v":0.89000392539810702},454.54342697283204,404.54543426972833,0.89000392539810702,{"$f":"'User Parameters'!$C$10","v":40},{"$f":"B90*'User Parameters'!$C$14","v":0},9.997992703103705,2.1995682062082227E-2,0.89000392539810702,{"$f":"IF(UP_RSBasis=\"MLR\",UP_RSTarget_MLR,IF(UP_RSBasis=\"Medical Baseline\",UP_RSTarget_Medlcal,0))","v":0},0,0,0,0,0,0,0,"",0,{"$f":"(S90+C90+'User Parameters'!$C$11)/(B90-F90)","v":0.89000392539810702},{"$f":"IF(T90<'User Parameters'!$J$5,'User Parameters'!$J$5,IF(T90>'User Parameters'!$J$6,'User Parameters'!$J$6,T90))","v":0.89000392539810702},0,0,{"$f":"(B90-C90-F90-E90-S90-V90)/'Results Dashboard'!$D$42","v":2.1995682062082227E-2},{"$f":"IF((X90+W90)>0,(X90+W90)*0.5*((1+'User Parameters'!C$48)^((12+UP_COC_WithholdLag)/12)-1),(X90+W90)*0.5*((1+'User Parameters'!$C$49)^((12+UP_COC_WithholdLag)/12)-1))","v":0},{"$f":"-'User Parameters'!$C$12*('User Parameters'!$C$13-1)","v":0},2.1995682062082227E-2,0.38072614852275471,{"$f":"AB89-AB90","v":5.8951276624835958E-2},5.8951276624835958E-2,{"$f":"IF($AA90<-'Results Dashboard'!$J$7,$AA90+'Results Dashboard'!$J$7,0)","v":0},{"$f":"IF($AA90<-'Results Dashboard'!$J$8,$AA90+'Results Dashboard'!$J$8,0)","v":0},{"$f":"IF($AA90<-'Results Dashboard'!$J$9,$AA90+'Results Dashboard'!$J$9,0)","v":0},{"$f":"IF($AA90<-'Results Dashboard'!$J$11,$AA90+'Results Dashboard'!$J$11,0)","v":0},{"$f":"IF($AA90<-'Results Dashboard'!$J$10,$AA90+'Results Dashboard'!$J$10,0)","v":0},null,{"$f":"IF((X90+W90)>0,(X90+W90)*0.5*'User Parameters'!C$48,(X90+W90)*0.5*'User Parameters'!$C$49)","v":0},{"$f":"-'User Parameters'!$C$12*('User Parameters'!$C$13-1)","v":0},2.1995682062082227E-2]
[0.89500392539810703,454.54342697283204,406.81815140459247,0.89500392539810703,{"$f":"'User Parameters'!$C$10","v":40},{"$f":"B91*'User Parameters'!$C$14","v":0},7.7252755682395673,1.6995682062082278E-2,0.89500392539810703,{"$f":"IF(UP_RSBasis=\"MLR\",UP_RSTarget_MLR,IF(UP_RSBasis=\"Medical Baseline\",UP_RSTarget_Medlcal,0))","v":0},0,0,0,0,0,0,0,"",0,{"$f":"(S91+C91+'User Parameters'!$C$11)/(B91-F91)","v":0.89500392539810703},{"$f":"IF(T91<'User Parameters'!$J$5,'User Parameters'!$J$5,IF(T91>'User Parameters'!$J$6,'User Parameters'!$J$6,T91))","v":0.89500392539810703},0,0,{"$f":"(B91-C91-F91-E91-S91-V91)/'Results Dashboard'!$D$42","v":1.6995682062082278E-2},{"$f":"IF((X91+W91)>0,(X91+W91)*0.5*((1+'User Parameters'!C$48)^((12+UP_COC_WithholdLag)/12)-1),(X91+W91)*0.5*((1+'User Parameters'!$C$49)^((12+UP_COC_WithholdLag)/12)-1))","v":0},{"$f":"-'User Parameters'!$C$12*('User Parameters'!$C$13-1)","v":0},1.6995682062082278E-2,0.32442465698788719,5.630149153486752E-2,5.630149153486752E-2,{"$f":"IF($AA91<-'Results Dashboard'!$J$7,$AA91+'Results Dashboard'!$J$7,0)","v":0},{"$f":"IF($AA91<-'Results Dashboard'!$J$8,$AA91+'Results Dashboard'!$J$8,0)","v":0},{"$f":"IF($AA91<-'Results Dashboard'!$J$9,$AA91+'Results Dashboard'!$J$9,0)","v":0},{"$f":"IF($AA91<-'Results Dashboard'!$J$11,$AA91+'Results Dashboard'!$J$11,0)","v":0},{"$f":"IF($AA91<-'Results Dashboard'!$J$10,$AA91+'Results Dashboard'!$J$10,0)","v":0},null,{"$f":"IF((X91+W91)>0,(X91+W91)*0.5*'User Parameters'!C$48,(X91+W91)*0.5*'User Parameters'!$C$49)","v":0},{"$f":"-'User Parameters'!$C$12*('User Parameters'!$C$13-1)","v":0},1.6995682062082278E-2]
[0.90000392539810703,454.54342697283204,409.09086853945661,0.90000392539810692,{"$f":"'User Parameters'!$C$10","v":40},{"$f":"B92*'User Parameters'!$C$14","v":0},5.4525584333754296,1.1995682062082328E-2,0.90000392539810692,{"$f":"IF(UP_RSBasis=\"MLR\",UP_RSTarget_MLR,IF(UP_RSBasis=\"Medical Baseline\",UP_RSTarget_Medlcal,0))","v":0},0,0,0,0,0,0,0,"",0,{"$f":"(S92+C92+'User Parameters'!$C$11)/(B92-F92)","v":0.90000392539810692},{"$f":"IF(T92<'User Parameters'!$J$5,'User Parameters'!$J$5,IF(T92>'User Parameters'!$J$6,'User Parameters'!$J$6,T92))","v":0.90000392539810692},0,0,{"$f":"(B92-C92-F92-E92-S92-V92)/'Results Dashboard'!$D$42","v":1.1995682062082328E-2},{"$f":"IF((X92+W92)>0,(X92+W92)*0.5*((1+'User Parameters'!C$48)^((12+UP_COC_WithholdLag)/12)-1),(X92+W92)*0.5*((1+'User Parameters'!$C$49)^((12+UP_COC_WithholdLag)/12)-1))","v":0},{"$f":"-'User Parameters'!$C$12*('User Parameters'!$C$13-1)","v":0},1.1995682062082328E-2,0.27187620502723353,5.2548451960653664E-2,5.2548451960653664E-2,{"$f":"IF($AA92<-'Results Dashboard'!$J$7,$AA92+'Results Dashboard'!$J$7,0)","v":0},{"$f":"IF($AA92<-'Results Dashboard'!$J$8,$AA92+'Results Dashboard'!$J$8,0)","v":0},{"$f":"IF($AA92<-'Results Dashboard'!$J$9,$AA92+'Results Dashboard'!$J$9,0)","v":0},{"$f":"IF($AA92<-'Results Dashboard'!$J$11,$AA92+'Results Dashboard'!$J$11,0)","v":0},{"$f":"IF($AA92<-'Results Dashboard'!$J$10,$AA92+'Results Dashboard'!$J$10,0)","v":0},null,{"$f":"IF((X92+W92)>0,(X92+W92)*0.5*'User Parameters'!C$48,(X92+W92)*0.5*'User Parameters'!$C$49)","v":0},{"$f":"-'User Parameters'!$C$12*('User Parameters'!$C$13-1)","v":0},1.1995682062082328E-2]
[0.90500392539810703,454.54342697283204,411.3635856743208,0.90500392539810703,{"$f":"'User Parameters'!$C$10","v":40},{"$f":"B93*'User Parameters'!$C$14","v":0},3.179841298511235,6.9956820620822513E-3,0.90500392539810703,{"$f":"IF(UP_RSBasis=\"MLR\",UP_RSTarget_MLR,IF(UP_RSBasis=\"Medical Baseline\",UP_RSTarget_Medlcal,0))","v":0},0,0,0,0,0,0,0,"",0,{"$f":"(S93+C93+'User Parameters'!$C$11)/(B93-F93)","v":0.90500392539810703},{"$f":"IF(T93<'User Parameters'!$J$5,'User Parameters'!$J$5,IF(T93>'User Parameters'!$J$6,'User Parameters'!$J$6,T93))","v":0.90500392539810703},0,0,{"$f":"(B93-C93-F93-E93-S93-V93)/'Results Dashboard'!$D$42","v":6.9956820620822513E-3},{"$f":"IF((X93+W93)>0,(X93+W93)*0.5*((1+'User Parameters'!C$48)^((12+UP_COC_WithholdLag)/12)-1),(X93+W93)*0.5*((1+'User Parameters'!$C$49)^((12+UP_COC_WithholdLag)/12)-1))","v":0},{"$f":"-'User Parameters'!$C$12*('User Parameters'!$C$13-1)","v":0},6.9956820620822513E-3,0.22394555816952258,4.7930646857710951E-2,4.7930646857710951E-2,{"$f":"IF($AA93<-'Results Dashboard'!$J$7,$AA93+'Results Dashboard'!$J$7,0)","v":0},{"$f":"IF($AA93<-'Results Dashboard'!$J$8,$AA93+'Results Dashboard'!$J$8,0)","v":0},{"$f":"IF($AA93<-'Results Dashboard'!$J$9,$AA93+'Results Dashboard'!$J$9,0)","v":0},{"$f":"IF($AA93<-'Results Dashboard'!$J$11,$AA93+'Results Dashboard'!$J$11,0)","v":0},{"$f":"IF($AA93<-'Results Dashboard'!$J$10,$AA93+'Results Dashboard'!$J$10,0)","v":0},null,{"$f":"IF((X93+W93)>0,(X93+W93)*0.5*'User Parameters'!C$48,(X93+W93)*0.5*'User Parameters'!$C$49)","v":0},{"$f":"-'User Parameters'!$C$12*('User Parameters'!$C$13-1)","v":0},6.9956820620822513E-3]
[0.91000392539810704,454.54342697283204,413.63630280918494,0.91000392539810704,{"$f":"'User Parameters'!$C$10","v":40},{"$f":"B94*'User Parameters'!$C$14","v":0},0.90712416364709725,1.995682062082301E-3,0.91000392539810704,{"$f":"IF(UP_RSBasis=\"MLR\",UP_RSTarget_MLR,IF(UP_RSBasis=\"Medical Baseline\",UP_RSTarget_Medlcal,0))","v":0},0,0,0,0,0,0,0,"",0,{"$f":"(S94+C94+'User Parameters'!$C$11)/(B94-F94)","v":0.91000392539810704},{"$f":"IF(T94<'User Parameters'!$J$5,'User Parameters'!$J$5,IF(T94>'User Parameters'!$J$6,'User Parameters'!$J$6,T94))","v":0.91000392539810704},0,0,{"$f":"(B94-C94-F94-E94-S94-V94)/'Results Dashboard'!$D$42","v":1.995682062082301E-3},{"$f":"IF((X94+W94)>0,(X94+W94)*0.5*((1+'User Parameters'!C$48)^((12+UP_COC_WithholdLag)/12)-1),(X94+W94)*0.5*((1+'User Parameters'!$C$49)^((12+UP_COC_WithholdLag)/12)-1))","v":0},{"$f":"-'User Parameters'!$C$12*('User Parameters'!$C$13-1)","v":0},1.995682062082301E-3,0.18122076322746977,4.2724794942052807E-2,4.2724794942052807E-2,{"$f":"IF($AA94<-'Results Dashboard'!$J$7,$AA94+'Results Dashboard'!$J$7,0)","v":0},{"$f":"IF($AA94<-'Results Dashboard'!$J$8,$AA94+'Results Dashboard'!$J$8,0)","v":0},{"$f":"IF($AA94<-'Results Dashboard'!$J$9,$AA94+'Results Dashboard'!$J$9,0)","v":0},{"$f":"IF($AA94<-'Results Dashboard'!$J$11,$AA94+'Results Dashboard'!$J$11,0)","v":0},{"$f":"IF($AA94<-'Results Dashboard'!$J$10,$AA94+'Results Dashboard'!$J$10,0)","v":0},null,{"$f":"IF((X94+W94)>0,(X94+W94)*0.5*'User Parameters'!C$48,(X94+W94)*0.5*'User Parameters'!$C$49)","v":0},{"$f":"-'User Parameters'!$C$12*('User Parameters'!$C$13-1)","v":0},1.995682062082301E-3]
[0.91500392539810704,454.54342697283204,415.90901994404913,0.91500392539810704,{"$f":"'User Parameters'!$C$10","v":40},{"$f":"B95*'User Parameters'!$C$14","v":0},-1.3655929712170973,-3.0043179379177745E-3,0.91500392539810704,{"$f":"IF(UP_RSBasis=\"MLR\",UP_RSTarget_MLR,IF(UP_RSBasis=\"Medical Baseline\",UP_RSTarget_Medlcal,0))","v":0},0,0,0,0,0,0,0,"",0,{"$f":"(S95+C95+'User Parameters'!$C$11)/(B95-F95)","v":0.91500392539810704},{"$f":"IF(T95<'User Parameters'!$J$5,'User Parameters'!$J$5,IF(T95>'User Parameters'!$J$6,'User Parameters'!$J$6,T95))","v":0.91500392539810704},0,0,{"$f":"(B95-C95-F95-E95-S95-V95)/'Results Dashboard'!$D$42","v":-3.0043179379177745E-3},{"$f":"IF((X95+W95)>0,(X95+W95)*0.5*((1+'User Parameters'!C$48)^((12+UP_COC_WithholdLag)/12)-1),(X95+W95)*0.5*((1+'User Parameters'!$C$49)^((12+UP_COC_WithholdLag)/12)-1))","v":0},{"$f":"-'User Parameters'!$C$12*('User Parameters'!$C$13-1)","v":0},-3.0043179379177745E-3,0.14400216501080806,3.7218598216661708E-2,3.7218598216661708E-2,{"$f":"IF($AA95<-'Results Dashboard'!$J$7,$AA95+'Results Dashboard'!$J$7,0)","v":0},{"$f":"IF($AA95<-'Results Dashboard'!$J$8,$AA95+'Results Dashboard'!$J$8,0)","v":0},{"$f":"IF($AA95<-'Results Dashboard'!$J$9,$AA95+'Results Dashboard'!$J$9,0)","v":0},{"$f":"IF($AA95<-'Results Dashboard'!$J$11,$AA95+'Results Dashboard'!$J$11,0)","v":0},{"$f":"IF($AA95<-'Results Dashboard'!$J$10,$AA95+'Results Dashboard'!$J$10,0)","v":0},null,{"$f":"IF((X95+W95)>0,(X95+W95)*0.5*'User Parameters'!C$48,(X95+W95)*0.5*'User Parameters'!$C$49)","v":0},{"$f":"-'User Parameters'!$C$12*('User Parameters'!$C$13-1)","v":0},-3.0043179379177745E-3]
[0.92000392539810705,454.54342697283204,418.18173707891327,0.92000392539810705,{"$f":"'User Parameters'!$C$10","v":40},{"$f":"B96*'User Parameters'!$C$14","v":0},-3.6383101060812351,-8.0043179379177248E-3,0.92000392539810705,{"$f":"IF(UP_RSBasis=\"MLR\",UP_RSTarget_MLR,IF(UP_RSBasis=\"Medical Baseline\",UP_RSTarget_Medlcal,0))","v":0},0,0,0,0,0,0,0,"",0,{"$f":"(S96+C96+'User Parameters'!$C$11)/(B96-F96)","v":0.92000392539810705},{"$f":"IF(T96<'User Parameters'!$J$5,'User Parameters'!$J$5,IF(T96>'User Parameters'!$J$6,'User Parameters'!$J$6,T96))","v":0.92000392539810705},0,0,{"$f":"(B96-C96-F96-E96-S96-V96)/'Results Dashboard'!$D$42","v":-8.0043179379177248E-3},{"$f":"IF((X96+W96)>0,(X96+W96)*0.5*((1+'User Parameters'!C$48)^((12+UP_COC_WithholdLag)/12)-1),(X96+W96)*0.5*((1+'User Parameters'!$C$49)^((12+UP_COC_WithholdLag)/12)-1))","v":0},{"$f":"-'User Parameters'!$C$12*('User Parameters'!$C$13-1)","v":0},-8.0043179379177248E-3,0.11231719071205568,3.1684974298752389E-2,3.1684974298752389E-2,{"$f":"IF($AA96<-'Results Dashboard'!$J$7,$AA96+'Results Dashboard'!$J$7,0)","v":0},{"$f":"IF($AA96<-'Results Dashboard'!$J$8,$AA96+'Results Dashboard'!$J$8,0)","v":0},{"$f":"IF($AA96<-'Results Dashboard'!$J$9,$AA96+'Results Dashboard'!$J$9,0)","v":0},{"$f":"IF($AA96<-'Results Dashboard'!$J$11,$AA96+'Results Dashboard'!$J$11,0)","v":0},{"$f":"IF($AA96<-'Results Dashboard'!$J$10,$AA96+'Results Dashboard'!$J$10,0)","v":0},null,{"$f":"IF((X96+W96)>0,(X96+W96)*0.5*'User Parameters'!C$48,(X96+W96)*0.5*'User Parameters'!$C$49)","v":0},{"$f":"-'User Parameters'!$C$12*('User Parameters'!$C$13-1)","v":0},-8.0043179379177248E-3]
[0.92500392539810705,454.54342697283204,420.45445421377747,0.92500392539810705,{"$f":"'User Parameters'!$C$10","v":40},{"$f":"B97*'User Parameters'!$C$14","v":0},-5.9110272409454296,-1.30043179379178E-2,0.92500392539810705,{"$f":"IF(UP_RSBasis=\"MLR\",UP_RSTarget_MLR,IF(UP_RSBasis=\"Medical Baseline\",UP_RSTarget_Medlcal,0))","v":0},0,0,0,0,0,0,0,"",0,{"$f":"(S97+C97+'User Parameters'!$C$11)/(B97-F97)","v":0.92500392539810705},{"$f":"IF(T97<'User Parameters'!$J$5,'User Parameters'!$J$5,IF(T97>'User Parameters'!$J$6,'User Parameters'!$J$6,T97))","v":0.92500392539810705},0,0,{"$f":"(B97-C97-F97-E97-S97-V97)/'Results Dashboard'!$D$42","v":-1.30043179379178E-2},{"$f":"IF((X97+W97)>0,(X97+W97)*0.5*((1+'User Parameters'!C$48)^((12+UP_COC_WithholdLag)/12)-1),(X97+W97)*0.5*((1+'User Parameters'!$C$49)^((12+UP_COC_WithholdLag)/12)-1))","v":0},{"$f":"-'User Parameters'!$C$12*('User Parameters'!$C$13-1)","v":0},-1.30043179379178E-2,8.5956303599589973E-2,2.6360887112465703E-2,2.6360887112465703E-2,{"$f":"IF($AA97<-'Results Dashboard'!$J$7,$AA97+'Results Dashboard'!$J$7,0)","v":0},{"$f":"IF($AA97<-'Results Dashboard'!$J$8,$AA97+'Results Dashboard'!$J$8,0)","v":0},{"$f":"IF($AA97<-'Results Dashboard'!$J$9,$AA97+'Results Dashboard'!$J$9,0)","v":0},{"$f":"IF($AA97<-'Results Dashboard'!$J$11,$AA97+'Results Dashboard'!$J$11,0)","v":0},{"$f":"IF($AA97<-'Results Dashboard'!$J$10,$AA97+'Results Dashboard'!$J$10,0)","v":0},null,{"$f":"IF((X97+W97)>0,(X97+W97)*0.5*'User Parameters'!C$48,(X97+W97)*0.5*'User Parameters'!$C$49)","v":0},{"$f":"-'User Parameters'!$C$12*('User Parameters'!$C$13-1)","v":0},-1.30043179379178E-2]
[0.93000392539810706,454.54342697283204,422.7271713486416,0.93000392539810706,{"$f":"'User Parameters'!$C$10","v":40},{"$f":"B98*'User Parameters'!$C$14","v":0},-8.1837443758095674,-1.8004317937917753E-2,0.93000392539810706,{"$f":"IF(UP_RSBasis=\"MLR\",UP_RSTarget_MLR,IF(UP_RSBasis=\"Medical Baseline\",UP_RSTarget_Medlcal,0))","v":0},0,0,0,0,0,0,0,"",0,{"$f":"(S98+C98+'User Parameters'!$C$11)/(B98-F98)","v":0.93000392539810706},{"$f":"IF(T98<'User Parameters'!$J$5,'User Parameters'!$J$5,IF(T98>'User Parameters'!$J$6,'User Parameters'!$J$6,T98))","v":0.93000392539810706},0,0,{"$f":"(B98-C98-F98-E98-S98-V98)/'Results Dashboard'!$D$42","v":-1.8004317937917753E-2},{"$f":"IF((X98+W98)>0,(X98+W98)*0.5*((1+'User Parameters'!C$48)^((12+UP_COC_WithholdLag)/12)-1),(X98+W98)*0.5*((1+'User Parameters'!$C$49)^((12+UP_COC_WithholdLag)/12)-1))","v":0},{"$f":"-'User Parameters'!$C$12*('User Parameters'!$C$13-1)","v":0},-1.8004317937917753E-2,6.4523450353203005E-2,2.1432853246386968E-2,2.1432853246386968E-2,{"$f":"IF($AA98<-'Results Dashboard'!$J$7,$AA98+'Results Dashboard'!$J$7,0)","v":0},{"$f":"IF($AA98<-'Results Dashboard'!$J$8,$AA98+'Results Dashboard'!$J$8,0)","v":0},{"$f":"IF($AA98<-'Results Dashboard'!$J$9,$AA98+'Results Dashboard'!$J$9,0)","v":0},{"$f":"IF($AA98<-'Results Dashboard'!$J$11,$AA98+'Results Dashboard'!$J$11,0)","v":0},{"$f":"IF($AA98<-'Results Dashboard'!$J$10,$AA98+'Results Dashboard'!$J$10,0)","v":0},null,{"$f":"IF((X98+W98)>0,(X98+W98)*0.5*'User Parameters'!C$48,(X98+W98)*0.5*'User Parameters'!$C$49)","v":0},{"$f":"-'User Parameters'!$C$12*('User Parameters'!$C$13-1)","v":0},-1.8004317937917753E-2]
[0.93500392539810706,454.54342697283204,424.9998884835058,0.93500392539810717,{"$f":"'User Parameters'!$C$10","v":40},{"$f":"B99*'User Parameters'!$C$14","v":0},-10.456461510673762,-2.3004317937917827E-2,0.93500392539810717,{"$f":"IF(UP_RSBasis=\"MLR\",UP_RSTarget_MLR,IF(UP_RSBasis=\"Medical Baseline\",UP_RSTarget_Medlcal,0))","v":0},0,0,0,0,0,0,0,"",0,{"$f":"(S99+C99+'User Parameters'!$C$11)/(B99-F99)","v":0.93500392539810717},{"$f":"IF(T99<'User Parameters'!$J$5,'User Parameters'!$J$5,IF(T99>'User Parameters'!$J$6,'User Parameters'!$J$6,T99))","v":0.93500392539810717},0,0,{"$f":"(B99-C99-F99-E99-S99-V99)/'Results Dashboard'!$D$42","v":-2.3004317937917827E-2},{"$f":"IF((X99+W99)>0,(X99+W99)*0.5*((1+'User Parameters'!C$48)^((12+UP_COC_WithholdLag)/12)-1),(X99+W99)*0.5*((1+'User Parameters'!$C$49)^((12+UP_COC_WithholdLag)/12)-1))","v":0},{"$f":"-'User Parameters'!$C$12*('User Parameters'!$C$13-1)","v":0},-2.3004317937917827E-2,4.749350489573894E-2,1.7029945457464064E-2,1.7029945457464064E-2,{"$f":"IF($AA99<-'Results Dashboard'!$J$7,$AA99+'Results Dashboard'!$J$7,0)","v":0},{"$f":"IF($AA99<-'Results Dashboard'!$J$8,$AA99+'Results Dashboard'!$J$8,0)","v":0},{"$f":"IF($AA99<-'Results Dashboard'!$J$9,$AA99+'Results Dashboard'!$J$9,0)","v":0},{"$f":"IF($AA99<-'Results Dashboard'!$J$11,$AA99+'Results Dashboard'!$J$11,0)","v":0},{"$f":"IF($AA99<-'Results Dashboard'!$J$10,$AA99+'Results Dashboard'!$J$10,0)","v":0},null,{"$f":"IF((X99+W99)>0,(X99+W99)*0.5*'User Parameters'!C$48,(X99+W99)*0.5*'User Parameters'!$C$49)","v":0},{"$f":"-'User Parameters'!$C$12*('User Parameters'!$C$13-1)","v":0},-2.3004317937917827E-2]
[0.94000392539810707,454.54342697283204,427.27260561836994,0.94000392539810707,{"$f":"'User Parameters'!$C$10","v":40},{"$f":"B100*'User Parameters'!$C$14","v":0},-12.7291786455379,-2.8004317937917779E-2,0.94000392539810707,{"$f":"IF(UP_RSBasis=\"MLR\",UP_RSTarget_MLR,IF(UP_RSBasis=\"Medical Baseline\",UP_RSTarget_Medlcal,0))","v":0},0,0,0,0,0,0,0,"",0,{"$f":"(S100+C100+'User Parameters'!$C$11)/(B100-F100)","v":0.94000392539810707},{"$f":"IF(T100<'User Parameters'!$J$5,'User Parameters'!$J$5,IF(T100>'User Parameters'!$J$6,'User Parameters'!$J$6,T100))","v":0.94000392539810707},0,0,{"$f":"(B100-C100-F100-E100-S100-V100)/'Results Dashboard'!$D$42","v":-2.8004317937917779E-2},{"$f":"IF((X100+W100)>0,(X100+W100)*0.5*((1+'User Parameters'!C$48)^((12+UP_COC_WithholdLag)/12)-1),(X100+W100)*0.5*((1+'User Parameters'!$C$49)^((12+UP_COC_WithholdLag)/12)-1))","v":0},{"$f":"-'User Parameters'!$C$12*('User Parameters'!$C$13-1)","v":0},-2.8004317937917779E-2,3.4269597132397148E-2,1.3223907763341793E-2,1.3223907763341793E-2,{"$f":"IF($AA100<-'Results Dashboard'!$J$7,$AA100+'Results Dashboard'!$J$7,0)","v":0},{"$f":"IF($AA100<-'Results Dashboard'!$J$8,$AA100+'Results Dashboard'!$J$8,0)","v":0},{"$f":"IF($AA100<-'Results Dashboard'!$J$9,$AA100+'Results Dashboard'!$J$9,0)","v":0},{"$f":"IF($AA100<-'Results Dashboard'!$J$11,$AA100+'Results Dashboard'!$J$11,0)","v":0},{"$f":"IF($AA100<-'Results Dashboard'!$J$10,$AA100+'Results Dashboard'!$J$10,0)","v":0},null,{"$f":"IF((X100+W100)>0,(X100+W100)*0.5*'User Parameters'!C$48,(X100+W100)*0.5*'User Parameters'!$C$49)","v":0},{"$f":"-'User Parameters'!$C$12*('User Parameters'!$C$13-1)","v":0},-2.8004317937917779E-2]
[0.94500392539810707,454.54342697283204,429.54532275323407,0.94500392539810707,{"$f":"'User Parameters'!$C$10","v":40},{"$f":"B101*'User Parameters'!$C$14","v":0},-15.001895780402037,-3.3004317937917728E-2,0.94500392539810707,{"$f":"IF(UP_RSBasis=\"MLR\",UP_RSTarget_MLR,IF(UP_RSBasis=\"Medical Baseline\",UP_RSTarget_Medlcal,0))","v":0},0,0,0,0,0,0,0,"",0,{"$f":"(S101+C101+'User Parameters'!$C$11)/(B101-F101)","v":0.94500392539810707},{"$f":"IF(T101<'User Parameters'!$J$5,'User Parameters'!$J$5,IF(T101>'User Parameters'!$J$6,'User Parameters'!$J$6,T101))","v":0.94500392539810707},0,0,{"$f":"(B101-C101-F101-E101-S101-V101)/'Results Dashboard'!$D$42","v":-3.3004317937917728E-2},{"$f":"IF((X101+W101)>0,(X101+W101)*0.5*((1+'User Parameters'!C$48)^((12+UP_COC_WithholdLag)/12)-1),(X101+W101)*0.5*((1+'User Parameters'!$C$49)^((12+UP_COC_WithholdLag)/12)-1))","v":0},{"$f":"-'User Parameters'!$C$12*('User Parameters'!$C$13-1)","v":0},-3.3004317937917728E-2,2.42345447877188E-2,1.0035052344678348E-2,1.0035052344678348E-2,{"$f":"IF($AA101<-'Results Dashboard'!$J$7,$AA101+'Results Dashboard'!$J$7,0)","v":0},{"$f":"IF($AA101<-'Results Dashboard'!$J$8,$AA101+'Results Dashboard'!$J$8,0)","v":0},{"$f":"IF($AA101<-'Results Dashboard'!$J$9,$AA101+'Results Dashboard'!$J$9,0)","v":0},{"$f":"IF($AA101<-'Results Dashboard'!$J$11,$AA101+'Results Dashboard'!$J$11,0)","v":0},{"$f":"IF($AA101<-'Results Dashboard'!$J$10,$AA101+'Results Dashboard'!$J$10,0)","v":0},null,{"$f":"IF((X101+W101)>0,(X101+W101)*0.5*'User Parameters'!C$48,(X101+W101)*0.5*'User Parameters'!$C$49)","v":0},{"$f":"-'User Parameters'!$C$12*('User Parameters'!$C$13-1)","v":0},-3.3004317937917728E-2]
[0.95000392539810707,454.54342697283204,431.81803988809827,0.95000392539810707,{"$f":"'User Parameters'!$C$10","v":40},{"$f":"B102*'User Parameters'!$C$14","v":0},-17.274612915266232,-3.8004317937917802E-2,0.95000392539810707,{"$f":"IF(UP_RSBasis=\"MLR\",UP_RSTarget_MLR,IF(UP_RSBasis=\"Medical Baseline\",UP_RSTarget_Medlcal,0))","v":0},0,0,0,0,0,0,0,"",0,{"$f":"(S102+C102+'User Parameters'!$C$11)/(B102-F102)","v":0.95000392539810707},{"$f":"IF(T102<'User Parameters'!$J$5,'User Parameters'!$J$5,IF(T102>'User Parameters'!$J$6,'User Parameters'!$J$6,T102))","v":0.95000392539810707},0,0,{"$f":"(B102-C102-F102-E102-S102-V102)/'Results Dashboard'!$D$42","v":-3.8004317937917802E-2},{"$f":"IF((X102+W102)>0,(X102+W102)*0.5*((1+'User Parameters'!C$48)^((12+UP_COC_WithholdLag)/12)-1),(X102+W102)*0.5*((1+'User Parameters'!$C$49)^((12+UP_COC_WithholdLag)/12)-1))","v":0},{"$f":"-'User Parameters'!$C$12*('User Parameters'!$C$13-1)","v":0},-3.8004317937917802E-2,1.6792492152092449E-2,7.4420526356263512E-3,7.4420526356263512E-3,{"$f":"IF($AA102<-'Results Dashboard'!$J$7,$AA102+'Results Dashboard'!$J$7,0)","v":-2.974643625138107E-3},{"$f":"IF($AA102<-'Results Dashboard'!$J$8,$AA102+'Results Dashboard'!$J$8,0)","v":0},{"$f":"IF($AA102<-'Results Dashboard'!$J$9,$AA102+'Results Dashboard'!$J$9,0)","v":0},{"$f":"IF($AA102<-'Results Dashboard'!$J$11,$AA102+'Results Dashboard'!$J$11,0)","v":0},{"$f":"IF($AA102<-'Results Dashboard'!$J$10,$AA102+'Results Dashboard'!$J$10,0)","v":0},null,{"$f":"IF((X102+W102)>0,(X102+W102)*0.5*'User Parameters'!C$48,(X102+W102)*0.5*'User Parameters'!$C$49)","v":0},{"$f":"-'User Parameters'!$C$12*('User Parameters'!$C$13-1)","v":0},-3.8004317937917802E-2]
[0.95500392539810708,454.54342697283204,434.09075702296241,0.95500392539810708,{"$f":"'User Parameters'!$C$10","v":40},{"$f":"B103*'User Parameters'!$C$14","v":0},-19.54733005013037,-4.3004317937917758E-2,{"$f":"($C103+UP_QIPMPM)/($B103-$F103)","v":0.95500392539810708},{"$f":"IF(UP_RSBasis=\"MLR\",UP_RSTarget_MLR,IF(UP_RSBasis=\"Medical Baseline\",UP_RSTarget_Medlcal,0))","v":0},0,0,0,0,0,0,0,"",0,{"$f":"(S103+C103+'User Parameters'!$C$11)/(B103-F103)","v":0.95500392539810708},{"$f":"IF(T103<'User Parameters'!$J$5,'User Parameters'!$J$5,IF(T103>'User Parameters'!$J$6,'User Parameters'!$J$6,T103))","v":0.95500392539810708},0,0,{"$f":"(B103-C103-F103-E103-S103-V103)/'Results Dashboard'!$D$42","v":-4.3004317937917758E-2},{"$f":"IF((X103+W103)>0,(X103+W103)*0.5*((1+'User Parameters'!C$48)^((12+UP_COC_WithholdLag)/12)-1),(X103+W103)*0.5*((1+'User Parameters'!$C$49)^((12+UP_COC_WithholdLag)/12)-1))","v":0},{"$f":"-'User Parameters'!$C$12*('User Parameters'!$C$13-1)","v":0},-4.3004317937917758E-2,1.1398887823661479E-2,5.3936043284309697E-3,5.3936043284309697E-3,{"$f":"IF($AA103<-'Results Dashboard'!$J$7,$AA103+'Results Dashboard'!$J$7,0)","v":-7.9746436251380629E-3},{"$f":"IF($AA103<-'Results Dashboard'!$J$8,$AA103+'Results Dashboard'!$J$8,0)","v":0},{"$f":"IF($AA103<-'Results Dashboard'!$J$9,$AA103+'Results Dashboard'!$J$9,0)","v":0},{"$f":"IF($AA103<-'Results Dashboard'!$J$11,$AA103+'Results Dashboard'!$J$11,0)","v":0},{"$f":"IF($AA103<-'Results Dashboard'!$J$10,$AA103+'Results Dashboard'!$J$10,0)","v":0},null,{"$f":"IF((X103+W103)>0,(X103+W103)*0.5*'User Parameters'!C$48,(X103+W103)*0.5*'User Parameters'!$C$49)","v":0},{"$f":"-'User Parameters'!$C$12*('User Parameters'!$C$13-1)","v":0},-4.3004317937917758E-2]
[0.96000392539810708,454.54342697283204,436.3634741578266,0.96000392539810708,{"$f":"'User Parameters'!$C$10","v":40},{"$f":"B104*'User Parameters'!$C$14","v":0},-21.820047184994564,-4.8004317937917831E-2,0.96000392539810708,{"$f":"IF(UP_RSBasis=\"MLR\",UP_RSTarget_MLR,IF(UP_RSBasis=\"Medical Baseline\",UP_RSTarget_Medlcal,0))","v":0},{"$f":"IF(UP_RSBasis=\"MLR\",J104-I104,IF(UP_RSBasis=\"Medical Baseline\",J104-$C104,0))","v":0},0,0,0,0,0,0,{"$f":"IF(UP_RSBasis=\"MLR\",SUMPRODUCT(L$4:Q$4,L104:Q104),\"\")","v":""},{"$f":"IF(UP_RSBasis=\"MLR\",R104*(B104-F104),SUMPRODUCT($L$4:$Q$4,$L104:$Q104))","v":0},{"$f":"(S104+C104+'User Parameters'!$C$11)/(B104-F104)","v":0.96000392539810708},{"$f":"IF(T104<'User Parameters'!$J$5,'User Parameters'!$J$5,IF(T104>'User Parameters'!$J$6,'User Parameters'!$J$6,T104))","v":0.96000392539810708},{"$f":"(U104-T104)*(B104-F104)","v":0},{"$f":"V104/B104","v":0},{"$f":"(B104-C104-F104-E104-S104-V104)/'Results Dashboard'!$D$42","v":-4.8004317937917831E-2},{"$f":"IF((X104+W104)>0,(X104+W104)*0.5*((1+'User Parameters'!C$48)^((12+UP_COC_WithholdLag)/12)-1),(X104+W104)*0.5*((1+'User Parameters'!$C$49)^((12+UP_COC_WithholdLag)/12)-1))","v":0},{"$f":"-'User Parameters'!$C$12*('User Parameters'!$C$13-1)","v":0},-4.8004317937917831E-2,{"$f":"_xlfn.NORM.DIST(H104,$AD$2,$AD$3,TRUE)","v":7.5787532072036402E-3},3.820134616457839E-3,3.820134616457839E-3,{"$f":"IF($AA104<-'Results Dashboard'!$J$7,$AA104+'Results Dashboard'!$J$7,0)","v":-1.2974643625138137E-2},{"$f":"IF($AA104<-'Results Dashboard'!$J$8,$AA104+'Results Dashboard'!$J$8,0)","v":0},{"$f":"IF($AA104<-'Results Dashboard'!$J$9,$AA104+'Results Dashboard'!$J$9,0)","v":0},{"$f":"IF($AA104<-'Results Dashboard'!$J$11,$AA104+'Results Dashboard'!$J$11,0)","v":0},{"$f":"IF($AA104<-'Results Dashboard'!$J$10,$AA104+'Results Dashboard'!$J$10,0)","v":0},null,{"$f":"IF((X104+W104)>0,(X104+W104)*0.5*'User Parameters'!C$48,(X104+W104)*0.5*'User Parameters'!$C$49)","v":0},{"$f":"-'User Parameters'!$C$12*('User Parameters'!$C$13-1)","v":0},-4.8004317937917831E-2]
[0.96500392539810709,454.54342697283204,438.63619129269074,0.96500392539810709,{"$f":"'User Parameters'!$C$10","v":40},{"$f":"B105*'User Parameters'!$C$14","v":0},-24.092764319858702,-5.300431793791778E-2,0.96500392539810709,{"$f":"IF(UP_RSBasis=\"MLR\",UP_RSTarget_MLR,IF(UP_RSBasis=\"Medical Baseline\",UP_RSTarget_Medlcal,0))","v":0},0,0,0,0,0,0,0,"",0,{"$f":"(S105+C105+'User Parameters'!$C$11)/(B105-F105)","v":0.96500392539810709},{"$f":"IF(T105<'User Parameters'!$J$5,'User Parameters'!$J$5,IF(T105>'User Parameters'!$J$6,'User Parameters'!$J$6,T105))","v":0.96500392539810709},0,0,{"$f":"(B105-C105-F105-E105-S105-V105)/'Results Dashboard'!$D$42","v":-5.300431793791778E-2},{"$f":"IF((X105+W105)>0,(X105+W105)*0.5*((1+'User Parameters'!C$48)^((12+UP_COC_WithholdLag)/12)-1),(X105+W105)*0.5*((1+'User Parameters'!$C$49)^((12+UP_COC_WithholdLag)/12)-1))","v":0},{"$f":"-'User Parameters'!$C$12*('User Parameters'!$C$13-1)","v":0},-5.300431793791778E-2,4.9345704275825502E-3,2.64418277962109E-3,2.64418277962109E-3,{"$f":"IF($AA105<-'Results Dashboard'!$J$7,$AA105+'Results Dashboard'!$J$7,0)","v":-1.7974643625138086E-2},{"$f":"IF($AA105<-'Results Dashboard'!$J$8,$AA105+'Results Dashboard'!$J$8,0)","v":0},{"$f":"IF($AA105<-'Results Dashboard'!$J$9,$AA105+'Results Dashboard'!$J$9,0)","v":0},{"$f":"IF($AA105<-'Results Dashboard'!$J$11,$AA105+'Results Dashboard'!$J$11,0)","v":0},{"$f":"IF($AA105<-'Results Dashboard'!$J$10,$AA105+'Results Dashboard'!$J$10,0)","v":0},null,{"$f":"IF((X105+W105)>0,(X105+W105)*0.5*'User Parameters'!C$48,(X105+W105)*0.5*'User Parameters'!$C$49)","v":0},{"$f":"-'User Parameters'!$C$12*('User Parameters'!$C$13-1)","v":0},-5.300431793791778E-2]
[0.97000392539810709,454.54342697283204,440.90890842755493,0.9700039253981072,{"$f":"'User Parameters'!$C$10","v":40},{"$f":"B106*'User Parameters'!$C$14","v":0},-26.365481454722897,-5.8004317937917854E-2,0.9700039253981072,{"$f":"IF(UP_RSBasis=\"MLR\",UP_RSTarget_MLR,IF(UP_RSBasis=\"Medical Baseline\",UP_RSTarget_Medlcal,0))","v":0},0,0,0,0,0,0,0,"",0,{"$f":"(S106+C106+'User Parameters'!$C$11)/(B106-F106)","v":0.9700039253981072},{"$f":"IF(T106<'User Parameters'!$J$5,'User Parameters'!$J$5,IF(T106>'User Parameters'!$J$6,'User Parameters'!$J$6,T106))","v":0.9700039253981072},0,0,{"$f":"(B106-C106-F106-E106-S106-V106)/'Results Dashboard'!$D$42","v":-5.8004317937917854E-2},{"$f":"IF((X106+W106)>0,(X106+W106)*0.5*((1+'User Parameters'!C$48)^((12+UP_COC_WithholdLag)/12)-1),(X106+W106)*0.5*((1+'User Parameters'!$C$49)^((12+UP_COC_WithholdLag)/12)-1))","v":0},{"$f":"-'User Parameters'!$C$12*('User Parameters'!$C$13-1)","v":0},-5.8004317937917854E-2,3.1459528939217327E-3,1.7886175336608175E-3,1.7886175336608175E-3,{"$f":"IF($AA106<-'Results Dashboard'!$J$7,$AA106+'Results Dashboard'!$J$7,0)","v":-2.2974643625138159E-2},{"$f":"IF($AA106<-'Results Dashboard'!$J$8,$AA106+'Results Dashboard'!$J$8,0)","v":0},{"$f":"IF($AA106<-'Results Dashboard'!$J$9,$AA106+'Results Dashboard'!$J$9,0)","v":0},{"$f":"IF($AA106<-'Results Dashboard'!$J$11,$AA106+'Results Dashboard'!$J$11,0)","v":0},{"$f":"IF($AA106<-'Results Dashboard'!$J$10,$AA106+'Results Dashboard'!$J$10,0)","v":0},null,{"$f":"IF((X106+W106)>0,(X106+W106)*0.5*'User Parameters'!C$48,(X106+W106)*0.5*'User Parameters'!$C$49)","v":0},{"$f":"-'User Parameters'!$C$12*('User Parameters'!$C$13-1)","v":0},-5.8004317937917854E-2]
[0.9750039253981071,454.54342697283204,443.18162556241907,0.9750039253981071,{"$f":"'User Parameters'!$C$10","v":40},{"$f":"B107*'User Parameters'!$C$14","v":0},-28.638198589587034,-6.3004317937917803E-2,0.9750039253981071,{"$f":"IF(UP_RSBasis=\"MLR\",UP_RSTarget_MLR,IF(UP_RSBasis=\"Medical Baseline\",UP_RSTarget_Medlcal,0))","v":0},0,0,0,0,0,0,0,"",0,{"$f":"(S107+C107+'User Parameters'!$C$11)/(B107-F107)","v":0.9750039253981071},{"$f":"IF(T107<'User Parameters'!$J$5,'User Parameters'!$J$5,IF(T107>'User Parameters'!$J$6,'User Parameters'!$J$6,T107))","v":0.9750039253981071},0,0,{"$f":"(B107-C107-F107-E107-S107-V107)/'Results Dashboard'!$D$42","v":-6.3004317937917803E-2},{"$f":"IF((X107+W107)>0,(X107+W107)*0.5*((1+'User Parameters'!C$48)^((12+UP_COC_WithholdLag)/12)-1),(X107+W107)*0.5*((1+'User Parameters'!$C$49)^((12+UP_COC_WithholdLag)/12)-1))","v":0},{"$f":"-'User Parameters'!$C$12*('User Parameters'!$C$13-1)","v":0},-6.3004317937917803E-2,1.9635739589797486E-3,1.1823789349419841E-3,1.1823789349419841E-3,{"$f":"IF($AA107<-'Results Dashboard'!$J$7,$AA107+'Results Dashboard'!$J$7,0)","v":-2.7974643625138108E-2},{"$f":"IF($AA107<-'Results Dashboard'!$J$8,$AA107+'Results Dashboard'!$J$8,0)","v":0},{"$f":"IF($AA107<-'Results Dashboard'!$J$9,$AA107+'Results Dashboard'!$J$9,0)","v":0},{"$f":"IF($AA107<-'Results Dashboard'!$J$11,$AA107+'Results Dashboard'!$J$11,0)","v":0},{"$f":"IF($AA107<-'Results Dashboard'!$J$10,$AA107+'Results Dashboard'!$J$10,0)","v":0},null,{"$f":"IF((X107+W107)>0,(X107+W107)*0.5*'User Parameters'!C$48,(X107+W107)*0.5*'User Parameters'!$C$49)","v":0},{"$f":"-'User Parameters'!$C$12*('User Parameters'!$C$13-1)","v":0},-6.3004317937917803E-2]
[0.9800039253981071,454.54342697283204,445.45434269728321,0.9800039253981071,{"$f":"'User Parameters'!$C$10","v":40},{"$f":"B108*'User Parameters'!$C$14","v":0},-30.910915724451172,-6.8004317937917752E-2,0.9800039253981071,{"$f":"IF(UP_RSBasis=\"MLR\",UP_RSTarget_MLR,IF(UP_RSBasis=\"Medical Baseline\",UP_RSTarget_Medlcal,0))","v":0},0,0,0,0,0,0,0,"",0,{"$f":"(S108+C108+'User Parameters'!$C$11)/(B108-F108)","v":0.9800039253981071},{"$f":"IF(T108<'User Parameters'!$J$5,'User Parameters'!$J$5,IF(T108>'User Parameters'!$J$6,'User Parameters'!$J$6,T108))","v":0.9800039253981071},0,0,{"$f":"(B108-C108-F108-E108-S108-V108)/'Results Dashboard'!$D$42","v":-6.8004317937917752E-2},{"$f":"IF((X108+W108)>0,(X108+W108)*0.5*((1+'User Parameters'!C$48)^((12+UP_COC_WithholdLag)/12)-1),(X108+W108)*0.5*((1+'User Parameters'!$C$49)^((12+UP_COC_WithholdLag)/12)-1))","v":0},{"$f":"-'User Parameters'!$C$12*('User Parameters'!$C$13-1)","v":0},-6.8004317937917752E-2,1.1997222501736969E-3,7.6385170880605168E-4,7.6385170880605168E-4,{"$f":"IF($AA108<-'Results Dashboard'!$J$7,$AA108+'Results Dashboard'!$J$7,0)","v":-3.2974643625138057E-2},{"$f":"IF($AA108<-'Results Dashboard'!$J$8,$AA108+'Results Dashboard'!$J$8,0)","v":0},{"$f":"IF($AA108<-'Results Dashboard'!$J$9,$AA108+'Results Dashboard'!$J$9,0)","v":0},{"$f":"IF($AA108<-'Results Dashboard'!$J$11,$AA108+'Results Dashboard'!$J$11,0)","v":0},{"$f":"IF($AA108<-'Results Dashboard'!$J$10,$AA108+'Results Dashboard'!$J$10,0)","v":0},null,{"$f":"IF((X108+W108)>0,(X108+W108)*0.5*'User Parameters'!C$48,(X108+W108)*0.5*'User Parameters'!$C$49)","v":0},{"$f":"-'User Parameters'!$C$12*('User Parameters'!$C$13-1)","v":0},-6.8004317937917752E-2]
[0.98500392539810711,454.54342697283204,447.7270598321474,0.98500392539810711,{"$f":"'User Parameters'!$C$10","v":40},{"$f":"B109*'User Parameters'!$C$14","v":0},-33.183632859315367,-7.300431793791784E-2,0.98500392539810711,{"$f":"IF(UP_RSBasis=\"MLR\",UP_RSTarget_MLR,IF(UP_RSBasis=\"Medical Baseline\",UP_RSTarget_Medlcal,0))","v":0},0,0,0,0,0,0,0,"",0,{"$f":"(S109+C109+'User Parameters'!$C$11)/(B109-F109)","v":0.98500392539810711},{"$f":"IF(T109<'User Parameters'!$J$5,'User Parameters'!$J$5,IF(T109>'User Parameters'!$J$6,'User Parameters'!$J$6,T109))","v":0.98500392539810711},0,0,{"$f":"(B109-C109-F109-E109-S109-V109)/'Results Dashboard'!$D$42","v":-7.300431793791784E-2},{"$f":"IF((X109+W109)>0,(X109+W109)*0.5*((1+'User Parameters'!C$48)^((12+UP_COC_WithholdLag)/12)-1),(X109+W109)*0.5*((1+'User Parameters'!$C$49)^((12+UP_COC_WithholdLag)/12)-1))","v":0},{"$f":"-'User Parameters'!$C$12*('User Parameters'!$C$13-1)","v":0},-7.300431793791784E-2,7.1746965113739551E-4,4.8225259903630143E-4,4.8225259903630143E-4,{"$f":"IF($AA109<-'Results Dashboard'!$J$7,$AA109+'Results Dashboard'!$J$7,0)","v":-3.7974643625138145E-2},{"$f":"IF($AA109<-'Results Dashboard'!$J$8,$AA109+'Results Dashboard'!$J$8,0)","v":-2.9449693123584503E-3},{"$f":"IF($AA109<-'Results Dashboard'!$J$9,$AA109+'Results Dashboard'!$J$9,0)","v":-2.9449693123584503E-3},{"$f":"IF($AA109<-'Results Dashboard'!$J$11,$AA109+'Results Dashboard'!$J$11,0)","v":0},{"$f":"IF($AA109<-'Results Dashboard'!$J$10,$AA109+'Results Dashboard'!$J$10,0)","v":0},null,{"$f":"IF((X109+W109)>0,(X109+W109)*0.5*'User Parameters'!C$48,(X109+W109)*0.5*'User Parameters'!$C$49)","v":0},{"$f":"-'User Parameters'!$C$12*('User Parameters'!$C$13-1)","v":0},-7.300431793791784E-2]
[0.99000392539810711,454.54342697283204,449.99977696701154,0.99000392539810711,{"$f":"'User Parameters'!$C$10","v":40},{"$f":"B110*'User Parameters'!$C$14","v":0},-35.456349994179504,-7.8004317937917789E-2,0.99000392539810711,{"$f":"IF(UP_RSBasis=\"MLR\",UP_RSTarget_MLR,IF(UP_RSBasis=\"Medical Baseline\",UP_RSTarget_Medlcal,0))","v":0},0,0,0,0,0,0,0,"",0,{"$f":"(S110+C110+'User Parameters'!$C$11)/(B110-F110)","v":0.99000392539810711},{"$f":"IF(T110<'User Parameters'!$J$5,'User Parameters'!$J$5,IF(T110>'User Parameters'!$J$6,'User Parameters'!$J$6,T110))","v":0.99000392539810711},0,0,{"$f":"(B110-C110-F110-E110-S110-V110)/'Results Dashboard'!$D$42","v":-7.8004317937917789E-2},{"$f":"IF((X110+W110)>0,(X110+W110)*0.5*((1+'User Parameters'!C$48)^((12+UP_COC_WithholdLag)/12)-1),(X110+W110)*0.5*((1+'User Parameters'!$C$49)^((12+UP_COC_WithholdLag)/12)-1))","v":0},{"$f":"-'User Parameters'!$C$12*('User Parameters'!$C$13-1)","v":0},-7.8004317937917789E-2,4.1992425772765152E-4,2.9754539340974399E-4,2.9754539340974399E-4,{"$f":"IF($AA110<-'Results Dashboard'!$J$7,$AA110+'Results Dashboard'!$J$7,0)","v":-4.2974643625138094E-2},{"$f":"IF($AA110<-'Results Dashboard'!$J$8,$AA110+'Results Dashboard'!$J$8,0)","v":-7.9449693123583992E-3},{"$f":"IF($AA110<-'Results Dashboard'!$J$9,$AA110+'Results Dashboard'!$J$9,0)","v":-7.9449693123583992E-3},{"$f":"IF($AA110<-'Results Dashboard'!$J$11,$AA110+'Results Dashboard'!$J$11,0)","v":0},{"$f":"IF($AA110<-'Results Dashboard'!$J$10,$AA110+'Results Dashboard'!$J$10,0)","v":0},null,{"$f":"IF((X110+W110)>0,(X110+W110)*0.5*'User Parameters'!C$48,(X110+W110)*0.5*'User Parameters'!$C$49)","v":0},{"$f":"-'User Parameters'!$C$12*('User Parameters'!$C$13-1)","v":0},-7.8004317937917789E-2]
[0.99500392539810711,454.54342697283204,452.27249410187574,0.99500392539810711,{"$f":"'User Parameters'!$C$10","v":40},{"$f":"B111*'User Parameters'!$C$14","v":0},-37.729067129043699,-8.3004317937917863E-2,0.99500392539810711,{"$f":"IF(UP_RSBasis=\"MLR\",UP_RSTarget_MLR,IF(UP_RSBasis=\"Medical Baseline\",UP_RSTarget_Medlcal,0))","v":0},0,0,0,0,0,0,0,"",0,{"$f":"(S111+C111+'User Parameters'!$C$11)/(B111-F111)","v":0.99500392539810711},{"$f":"IF(T111<'User Parameters'!$J$5,'User Parameters'!$J$5,IF(T111>'User Parameters'!$J$6,'User Parameters'!$J$6,T111))","v":0.99500392539810711},0,0,{"$f":"(B111-C111-F111-E111-S111-V111)/'Results Dashboard'!$D$42","v":-8.3004317937917863E-2},{"$f":"IF((X111+W111)>0,(X111+W111)*0.5*((1+'User Parameters'!C$48)^((12+UP_COC_WithholdLag)/12)-1),(X111+W111)*0.5*((1+'User Parameters'!$C$49)^((12+UP_COC_WithholdLag)/12)-1))","v":0},{"$f":"-'User Parameters'!$C$12*('User Parameters'!$C$13-1)","v":0},-8.3004317937917863E-2,2.4051493959498566E-4,1.7940931813266586E-4,1.7940931813266586E-4,{"$f":"IF($AA111<-'Results Dashboard'!$J$7,$AA111+'Results Dashboard'!$J$7,0)","v":-4.7974643625138168E-2},{"$f":"IF($AA111<-'Results Dashboard'!$J$8,$AA111+'Results Dashboard'!$J$8,0)","v":-1.2944969312358473E-2},{"$f":"IF($AA111<-'Results Dashboard'!$J$9,$AA111+'Results Dashboard'!$J$9,0)","v":-1.2944969312358473E-2},{"$f":"IF($AA111<-'Results Dashboard'!$J$11,$AA111+'Results Dashboard'!$J$11,0)","v":0},{"$f":"IF($AA111<-'Results Dashboard'!$J$10,$AA111+'Results Dashboard'!$J$10,0)","v":0},null,{"$f":"IF((X111+W111)>0,(X111+W111)*0.5*'User Parameters'!C$48,(X111+W111)*0.5*'User Parameters'!$C$49)","v":0},{"$f":"-'User Parameters'!$C$12*('User Parameters'!$C$13-1)","v":0},-8.3004317937917863E-2]
[1.000003925398107,454.54342697283204,454.54521123673982,1.000003925398107,{"$f":"'User Parameters'!$C$10","v":40},{"$f":"B112*'User Parameters'!$C$14","v":0},-40.00178426390778,-8.8004317937917687E-2,1.000003925398107,{"$f":"IF(UP_RSBasis=\"MLR\",UP_RSTarget_MLR,IF(UP_RSBasis=\"Medical Baseline\",UP_RSTarget_Medlcal,0))","v":0},0,0,0,0,0,0,0,"",0,{"$f":"(S112+C112+'User Parameters'!$C$11)/(B112-F112)","v":1.000003925398107},{"$f":"IF(T112<'User Parameters'!$J$5,'User Parameters'!$J$5,IF(T112>'User Parameters'!$J$6,'User Parameters'!$J$6,T112))","v":1.000003925398107},0,0,{"$f":"(B112-C112-F112-E112-S112-V112)/'Results Dashboard'!$D$42","v":-8.8004317937917687E-2},{"$f":"IF((X112+W112)>0,(X112+W112)*0.5*((1+'User Parameters'!C$48)^((12+UP_COC_WithholdLag)/12)-1),(X112+W112)*0.5*((1+'User Parameters'!$C$49)^((12+UP_COC_WithholdLag)/12)-1))","v":0},{"$f":"-'User Parameters'!$C$12*('User Parameters'!$C$13-1)","v":0},-8.8004317937917687E-2,1.3479671793190917E-4,1.0571822166307649E-4,1.0571822166307649E-4,{"$f":"IF($AA112<-'Results Dashboard'!$J$7,$AA112+'Results Dashboard'!$J$7,0)","v":-5.2974643625137992E-2},{"$f":"IF($AA112<-'Results Dashboard'!$J$8,$AA112+'Results Dashboard'!$J$8,0)","v":-1.7944969312358297E-2},{"$f":"IF($AA112<-'Results Dashboard'!$J$9,$AA112+'Results Dashboard'!$J$9,0)","v":-1.7944969312358297E-2},{"$f":"IF($AA112<-'Results Dashboard'!$J$11,$AA112+'Results Dashboard'!$J$11,0)","v":0},{"$f":"IF($AA112<-'Results Dashboard'!$J$10,$AA112+'Results Dashboard'!$J$10,0)","v":0},null,{"$f":"IF((X112+W112)>0,(X112+W112)*0.5*'User Parameters'!C$48,(X112+W112)*0.5*'User Parameters'!$C$49)","v":0},{"$f":"-'User Parameters'!$C$12*('User Parameters'!$C$13-1)","v":0},-8.8004317937917687E-2]
[1.0050039253981069,454.54342697283204,456.81792837160395,1.0050039253981069,{"$f":"'User Parameters'!$C$10","v":40},{"$f":"B113*'User Parameters'!$C$14","v":0},-42.274501398771918,-9.3004317937917635E-2,1.0050039253981069,{"$f":"IF(UP_RSBasis=\"MLR\",UP_RSTarget_MLR,IF(UP_RSBasis=\"Medical Baseline\",UP_RSTarget_Medlcal,0))","v":0},0,0,0,0,0,0,0,"",0,{"$f":"(S113+C113+'User Parameters'!$C$11)/(B113-F113)","v":1.0050039253981069},{"$f":"IF(T113<'User Parameters'!$J$5,'User Parameters'!$J$5,IF(T113>'User Parameters'!$J$6,'User Parameters'!$J$6,T113))","v":1.0050039253981069},0,0,{"$f":"(B113-C113-F113-E113-S113-V113)/'Results Dashboard'!$D$42","v":-9.3004317937917635E-2},{"$f":"IF((X113+W113)>0,(X113+W113)*0.5*((1+'User Parameters'!C$48)^((12+UP_COC_WithholdLag)/12)-1),(X113+W113)*0.5*((1+'User Parameters'!$C$49)^((12+UP_COC_WithholdLag)/12)-1))","v":0},{"$f":"-'User Parameters'!$C$12*('User Parameters'!$C$13-1)","v":0},-9.3004317937917635E-2,7.3917681731987598E-5,6.0879036199921571E-5,6.0879036199921571E-5,{"$f":"IF($AA113<-'Results Dashboard'!$J$7,$AA113+'Results Dashboard'!$J$7,0)","v":-5.7974643625137941E-2},{"$f":"IF($AA113<-'Results Dashboard'!$J$8,$AA113+'Results Dashboard'!$J$8,0)","v":-2.2944969312358246E-2},{"$f":"IF($AA113<-'Results Dashboard'!$J$9,$AA113+'Results Dashboard'!$J$9,0)","v":-2.2944969312358246E-2},{"$f":"IF($AA113<-'Results Dashboard'!$J$11,$AA113+'Results Dashboard'!$J$11,0)","v":0},{"$f":"IF($AA113<-'Results Dashboard'!$J$10,$AA113+'Results Dashboard'!$J$10,0)","v":0},null,{"$f":"IF((X113+W113)>0,(X113+W113)*0.5*'User Parameters'!C$48,(X113+W113)*0.5*'User Parameters'!$C$49)","v":0},{"$f":"-'User Parameters'!$C$12*('User Parameters'!$C$13-1)","v":0},-9.3004317937917635E-2]
[1.0100039253981068,454.54342697283204,459.09064550646804,1.0100039253981068,{"$f":"'User Parameters'!$C$10","v":40},{"$f":"B114*'User Parameters'!$C$14","v":0},-44.547218533635998,-9.8004317937917459E-2,1.0100039253981068,{"$f":"IF(UP_RSBasis=\"MLR\",UP_RSTarget_MLR,IF(UP_RSBasis=\"Medical Baseline\",UP_RSTarget_Medlcal,0))","v":0},0,0,0,0,0,0,0,"",0,{"$f":"(S114+C114+'User Parameters'!$C$11)/(B114-F114)","v":1.0100039253981068},{"$f":"IF(T114<'User Parameters'!$J$5,'User Parameters'!$J$5,IF(T114>'User Parameters'!$J$6,'User Parameters'!$J$6,T114))","v":1.0100039253981068},0,0,{"$f":"(B114-C114-F114-E114-S114-V114)/'Results Dashboard'!$D$42","v":-9.8004317937917459E-2},{"$f":"IF((X114+W114)>0,(X114+W114)*0.5*((1+'User Parameters'!C$48)^((12+UP_COC_WithholdLag)/12)-1),(X114+W114)*0.5*((1+'User Parameters'!$C$49)^((12+UP_COC_WithholdLag)/12)-1))","v":0},{"$f":"-'User Parameters'!$C$12*('User Parameters'!$C$13-1)","v":0},-9.8004317937917459E-2,3.9656784701276072E-5,3.4260897030711525E-5,3.4260897030711525E-5,{"$f":"IF($AA114<-'Results Dashboard'!$J$7,$AA114+'Results Dashboard'!$J$7,0)","v":-6.2974643625137772E-2},{"$f":"IF($AA114<-'Results Dashboard'!$J$8,$AA114+'Results Dashboard'!$J$8,0)","v":-2.794496931235807E-2},{"$f":"IF($AA114<-'Results Dashboard'!$J$9,$AA114+'Results Dashboard'!$J$9,0)","v":-2.794496931235807E-2},{"$f":"IF($AA114<-'Results Dashboard'!$J$11,$AA114+'Results Dashboard'!$J$11,0)","v":0},{"$f":"IF($AA114<-'Results Dashboard'!$J$10,$AA114+'Results Dashboard'!$J$10,0)","v":0},null,{"$f":"IF((X114+W114)>0,(X114+W114)*0.5*'User Parameters'!C$48,(X114+W114)*0.5*'User Parameters'!$C$49)","v":0},{"$f":"-'User Parameters'!$C$12*('User Parameters'!$C$13-1)","v":0},-9.8004317937917459E-2]
[1.0150039253981067,454.54342697283204,461.36336264133217,1.0150039253981067,{"$f":"'User Parameters'!$C$10","v":40},{"$f":"B115*'User Parameters'!$C$14","v":0},-46.819935668500136,-0.10300431793791741,1.0150039253981067,{"$f":"IF(UP_RSBasis=\"MLR\",UP_RSTarget_MLR,IF(UP_RSBasis=\"Medical Baseline\",UP_RSTarget_Medlcal,0))","v":0},0,0,0,0,0,0,0,"",0,{"$f":"(S115+C115+'User Parameters'!$C$11)/(B115-F115)","v":1.0150039253981067},{"$f":"IF(T115<'User Parameters'!$J$5,'User Parameters'!$J$5,IF(T115>'User Parameters'!$J$6,'User Parameters'!$J$6,T115))","v":1.0150039253981067},0,0,{"$f":"(B115-C115-F115-E115-S115-V115)/'Results Dashboard'!$D$42","v":-0.10300431793791741},{"$f":"IF((X115+W115)>0,(X115+W115)*0.5*((1+'User Parameters'!C$48)^((12+UP_COC_WithholdLag)/12)-1),(X115+W115)*0.5*((1+'User Parameters'!$C$49)^((12+UP_COC_WithholdLag)/12)-1))","v":0},{"$f":"-'User Parameters'!$C$12*('User Parameters'!$C$13-1)","v":0},-0.10300431793791741,2.0814103162059954E-5,1.8842681539216119E-5,1.8842681539216119E-5,{"$f":"IF($AA115<-'Results Dashboard'!$J$7,$AA115+'Results Dashboard'!$J$7,0)","v":-6.7974643625137721E-2},{"$f":"IF($AA115<-'Results Dashboard'!$J$8,$AA115+'Results Dashboard'!$J$8,0)","v":-3.2944969312358019E-2},{"$f":"IF($AA115<-'Results Dashboard'!$J$9,$AA115+'Results Dashboard'!$J$9,0)","v":-3.2944969312358019E-2},{"$f":"IF($AA115<-'Results Dashboard'!$J$11,$AA115+'Results Dashboard'!$J$11,0)","v":0},{"$f":"IF($AA115<-'Results Dashboard'!$J$10,$AA115+'Results Dashboard'!$J$10,0)","v":0},null,{"$f":"IF((X115+W115)>0,(X115+W115)*0.5*'User Parameters'!C$48,(X115+W115)*0.5*'User Parameters'!$C$49)","v":0},{"$f":"-'User Parameters'!$C$12*('User Parameters'!$C$13-1)","v":0},-0.10300431793791741]
[1.0200039253981066,454.54342697283204,463.63607977619625,1.0200039253981066,{"$f":"'User Parameters'!$C$10","v":40},{"$f":"B116*'User Parameters'!$C$14","v":0},-49.092652803364217,-0.10800431793791723,1.0200039253981066,{"$f":"IF(UP_RSBasis=\"MLR\",UP_RSTarget_MLR,IF(UP_RSBasis=\"Medical Baseline\",UP_RSTarget_Medlcal,0))","v":0},0,0,0,0,0,0,0,"",0,{"$f":"(S116+C116+'User Parameters'!$C$11)/(B116-F116)","v":1.0200039253981066},{"$f":"IF(T116<'User Parameters'!$J$5,'User Parameters'!$J$5,IF(T116>'User Parameters'!$J$6,'User Parameters'!$J$6,T116))","v":1.0200039253981066},0,0,{"$f":"(B116-C116-F116-E116-S116-V116)/'Results Dashboard'!$D$42","v":-0.10800431793791723},{"$f":"IF((X116+W116)>0,(X116+W116)*0.5*((1+'User Parameters'!C$48)^((12+UP_COC_WithholdLag)/12)-1),(X116+W116)*0.5*((1+'User Parameters'!$C$49)^((12+UP_COC_WithholdLag)/12)-1))","v":0},{"$f":"-'User Parameters'!$C$12*('User Parameters'!$C$13-1)","v":0},-0.10800431793791723,1.0686663177765781E-5,1.0127439984294173E-5,1.0127439984294173E-5,{"$f":"IF($AA116<-'Results Dashboard'!$J$7,$AA116+'Results Dashboard'!$J$7,0)","v":-7.2974643625137531E-2},{"$f":"IF($AA116<-'Results Dashboard'!$J$8,$AA116+'Results Dashboard'!$J$8,0)","v":-3.7944969312357843E-2},{"$f":"IF($AA116<-'Results Dashboard'!$J$9,$AA116+'Results Dashboard'!$J$9,0)","v":-3.7944969312357843E-2},{"$f":"IF($AA116<-'Results Dashboard'!$J$11,$AA116+'Results Dashboard'!$J$11,0)","v":0},{"$f":"IF($AA116<-'Results Dashboard'!$J$10,$AA116+'Results Dashboard'!$J$10,0)","v":0},null,{"$f":"IF((X116+W116)>0,(X116+W116)*0.5*'User Parameters'!C$48,(X116+W116)*0.5*'User Parameters'!$C$49)","v":0},{"$f":"-'User Parameters'!$C$12*('User Parameters'!$C$13-1)","v":0},-0.10800431793791723]
[1.0250039253981065,454.54342697283204,465.90879691106039,1.0250039253981065,{"$f":"'User Parameters'!$C$10","v":40},{"$f":"B117*'User Parameters'!$C$14","v":0},-51.365369938228355,-0.11300431793791718,1.0250039253981065,{"$f":"IF(UP_RSBasis=\"MLR\",UP_RSTarget_MLR,IF(UP_RSBasis=\"Medical Baseline\",UP_RSTarget_Medlcal,0))","v":0},0,0,0,0,0,0,0,"",0,{"$f":"(S117+C117+'User Parameters'!$C$11)/(B117-F117)","v":1.0250039253981065},{"$f":"IF(T117<'User Parameters'!$J$5,'User Parameters'!$J$5,IF(T117>'User Parameters'!$J$6,'User Parameters'!$J$6,T117))","v":1.0250039253981065},0,0,{"$f":"(B117-C117-F117-E117-S117-V117)/'Results Dashboard'!$D$42","v":-0.11300431793791718},{"$f":"IF((X117+W117)>0,(X117+W117)*0.5*((1+'User Parameters'!C$48)^((12+UP_COC_WithholdLag)/12)-1),(X117+W117)*0.5*((1+'User Parameters'!$C$49)^((12+UP_COC_WithholdLag)/12)-1))","v":0},{"$f":"-'User Parameters'!$C$12*('User Parameters'!$C$13-1)","v":0},-0.11300431793791718,5.3671778771310531E-6,5.3194853006347276E-6,5.3194853006347276E-6,{"$f":"IF($AA117<-'Results Dashboard'!$J$7,$AA117+'Results Dashboard'!$J$7,0)","v":-7.797464362513748E-2},{"$f":"IF($AA117<-'Results Dashboard'!$J$8,$AA117+'Results Dashboard'!$J$8,0)","v":-4.2944969312357792E-2},{"$f":"IF($AA117<-'Results Dashboard'!$J$9,$AA117+'Results Dashboard'!$J$9,0)","v":-4.2944969312357792E-2},{"$f":"IF($AA117<-'Results Dashboard'!$J$11,$AA117+'Results Dashboard'!$J$11,0)","v":0},{"$f":"IF($AA117<-'Results Dashboard'!$J$10,$AA117+'Results Dashboard'!$J$10,0)","v":0},null,{"$f":"IF((X117+W117)>0,(X117+W117)*0.5*'User Parameters'!C$48,(X117+W117)*0.5*'User Parameters'!$C$49)","v":0},{"$f":"-'User Parameters'!$C$12*('User Parameters'!$C$13-1)","v":0},-0.11300431793791718]
[1.0300039253981064,454.54342697283204,468.18151404592447,1.0300039253981064,{"$f":"'User Parameters'!$C$10","v":40},{"$f":"B118*'User Parameters'!$C$14","v":0},-53.638087073092436,-0.11800431793791702,1.0300039253981064,{"$f":"IF(UP_RSBasis=\"MLR\",UP_RSTarget_MLR,IF(UP_RSBasis=\"Medical Baseline\",UP_RSTarget_Medlcal,0))","v":0},0,0,0,0,0,0,0,"",0,{"$f":"(S118+C118+'User Parameters'!$C$11)/(B118-F118)","v":1.0300039253981064},{"$f":"IF(T118<'User Parameters'!$J$5,'User Parameters'!$J$5,IF(T118>'User Parameters'!$J$6,'User Parameters'!$J$6,T118))","v":1.0300039253981064},0,0,{"$f":"(B118-C118-F118-E118-S118-V118)/'Results Dashboard'!$D$42","v":-0.11800431793791702},{"$f":"IF((X118+W118)>0,(X118+W118)*0.5*((1+'User Parameters'!C$48)^((12+UP_COC_WithholdLag)/12)-1),(X118+W118)*0.5*((1+'User Parameters'!$C$49)^((12+UP_COC_WithholdLag)/12)-1))","v":0},{"$f":"-'User Parameters'!$C$12*('User Parameters'!$C$13-1)","v":0},-0.11800431793791702,2.6366130898262788E-6,2.7305647873047743E-6,2.7305647873047743E-6,{"$f":"IF($AA118<-'Results Dashboard'!$J$7,$AA118+'Results Dashboard'!$J$7,0)","v":-8.2974643625137318E-2},{"$f":"IF($AA118<-'Results Dashboard'!$J$8,$AA118+'Results Dashboard'!$J$8,0)","v":-4.794496931235763E-2},{"$f":"IF($AA118<-'Results Dashboard'!$J$9,$AA118+'Results Dashboard'!$J$9,0)","v":-4.794496931235763E-2},{"$f":"IF($AA118<-'Results Dashboard'!$J$11,$AA118+'Results Dashboard'!$J$11,0)","v":0},{"$f":"IF($AA118<-'Results Dashboard'!$J$10,$AA118+'Results Dashboard'!$J$10,0)","v":0},null,{"$f":"IF((X118+W118)>0,(X118+W118)*0.5*'User Parameters'!C$48,(X118+W118)*0.5*'User Parameters'!$C$49)","v":0},{"$f":"-'User Parameters'!$C$12*('User Parameters'!$C$13-1)","v":0},-0.11800431793791702]
[1.0350039253981063,454.54342697283204,470.45423118078861,1.0350039253981063,{"$f":"'User Parameters'!$C$10","v":40},{"$f":"B119*'User Parameters'!$C$14","v":0},-55.910804207956573,-0.12300431793791697,1.0350039253981063,{"$f":"IF(UP_RSBasis=\"MLR\",UP_RSTarget_MLR,IF(UP_RSBasis=\"Medical Baseline\",UP_RSTarget_Medlcal,0))","v":0},0,0,0,0,0,0,0,"",0,{"$f":"(S119+C119+'User Parameters'!$C$11)/(B119-F119)","v":1.0350039253981063},{"$f":"IF(T119<'User Parameters'!$J$5,'User Parameters'!$J$5,IF(T119>'User Parameters'!$J$6,'User Parameters'!$J$6,T119))","v":1.0350039253981063},0,0,{"$f":"(B119-C119-F119-E119-S119-V119)/'Results Dashboard'!$D$42","v":-0.12300431793791697},{"$f":"IF((X119+W119)>0,(X119+W119)*0.5*((1+'User Parameters'!C$48)^((12+UP_COC_WithholdLag)/12)-1),(X119+W119)*0.5*((1+'User Parameters'!$C$49)^((12+UP_COC_WithholdLag)/12)-1))","v":0},{"$f":"-'User Parameters'!$C$12*('User Parameters'!$C$13-1)","v":0},-0.12300431793791697,1.2668411465187063E-6,1.3697719433075725E-6,1.3697719433075725E-6,{"$f":"IF($AA119<-'Results Dashboard'!$J$7,$AA119+'Results Dashboard'!$J$7,0)","v":-8.7974643625137267E-2},{"$f":"IF($AA119<-'Results Dashboard'!$J$8,$AA119+'Results Dashboard'!$J$8,0)","v":-5.2944969312357579E-2},{"$f":"IF($AA119<-'Results Dashboard'!$J$9,$AA119+'Results Dashboard'!$J$9,0)","v":-5.2944969312357579E-2},{"$f":"IF($AA119<-'Results Dashboard'!$J$11,$AA119+'Results Dashboard'!$J$11,0)","v":0},{"$f":"IF($AA119<-'Results Dashboard'!$J$10,$AA119+'Results Dashboard'!$J$10,0)","v":0},null,{"$f":"IF((X119+W119)>0,(X119+W119)*0.5*'User Parameters'!C$48,(X119+W119)*0.5*'User Parameters'!$C$49)","v":0},{"$f":"-'User Parameters'!$C$12*('User Parameters'!$C$13-1)","v":0},-0.12300431793791697]
[1.0400039253981062,454.54342697283204,472.72694831565275,1.0400039253981062,{"$f":"'User Parameters'!$C$10","v":40},{"$f":"B120*'User Parameters'!$C$14","v":0},-58.183521342820711,-0.12800431793791692,1.0400039253981062,{"$f":"IF(UP_RSBasis=\"MLR\",UP_RSTarget_MLR,IF(UP_RSBasis=\"Medical Baseline\",UP_RSTarget_Medlcal,0))","v":0},0,0,0,0,0,0,0,"",0,{"$f":"(S120+C120+'User Parameters'!$C$11)/(B120-F120)","v":1.0400039253981062},{"$f":"IF(T120<'User Parameters'!$J$5,'User Parameters'!$J$5,IF(T120>'User Parameters'!$J$6,'User Parameters'!$J$6,T120))","v":1.0400039253981062},0,0,{"$f":"(B120-C120-F120-E120-S120-V120)/'Results Dashboard'!$D$42","v":-0.12800431793791692},{"$f":"IF((X120+W120)>0,(X120+W120)*0.5*((1+'User Parameters'!C$48)^((12+UP_COC_WithholdLag)/12)-1),(X120+W120)*0.5*((1+'User Parameters'!$C$49)^((12+UP_COC_WithholdLag)/12)-1))","v":0},{"$f":"-'User Parameters'!$C$12*('User Parameters'!$C$13-1)","v":0},-0.12800431793791692,5.9532427759079036E-7,6.7151686892791595E-7,6.7151686892791595E-7,{"$f":"IF($AA120<-'Results Dashboard'!$J$7,$AA120+'Results Dashboard'!$J$7,0)","v":-9.2974643625137215E-2},{"$f":"IF($AA120<-'Results Dashboard'!$J$8,$AA120+'Results Dashboard'!$J$8,0)","v":-5.7944969312357528E-2},{"$f":"IF($AA120<-'Results Dashboard'!$J$9,$AA120+'Results Dashboard'!$J$9,0)","v":-5.7944969312357528E-2},{"$f":"IF($AA120<-'Results Dashboard'!$J$11,$AA120+'Results Dashboard'!$J$11,0)","v":0},{"$f":"IF($AA120<-'Results Dashboard'!$J$10,$AA120+'Results Dashboard'!$J$10,0)","v":0},null,{"$f":"IF((X120+W120)>0,(X120+W120)*0.5*'User Parameters'!C$48,(X120+W120)*0.5*'User Parameters'!$C$49)","v":0},{"$f":"-'User Parameters'!$C$12*('User Parameters'!$C$13-1)","v":0},-0.12800431793791692]
[1.045003925398106,454.54342697283204,474.99966545051683,1.045003925398106,{"$f":"'User Parameters'!$C$10","v":40},{"$f":"B121*'User Parameters'!$C$14","v":0},-60.456238477684792,-0.13300431793791673,1.045003925398106,{"$f":"IF(UP_RSBasis=\"MLR\",UP_RSTarget_MLR,IF(UP_RSBasis=\"Medical Baseline\",UP_RSTarget_Medlcal,0))","v":0},0,0,0,0,0,0,0,"",0,{"$f":"(S121+C121+'User Parameters'!$C$11)/(B121-F121)","v":1.045003925398106},{"$f":"IF(T121<'User Parameters'!$J$5,'User Parameters'!$J$5,IF(T121>'User Parameters'!$J$6,'User Parameters'!$J$6,T121))","v":1.045003925398106},0,0,{"$f":"(B121-C121-F121-E121-S121-V121)/'Results Dashboard'!$D$42","v":-0.13300431793791673},{"$f":"IF((X121+W121)>0,(X121+W121)*0.5*((1+'User Parameters'!C$48)^((12+UP_COC_WithholdLag)/12)-1),(X121+W121)*0.5*((1+'User Parameters'!$C$49)^((12+UP_COC_WithholdLag)/12)-1))","v":0},{"$f":"-'User Parameters'!$C$12*('User Parameters'!$C$13-1)","v":0},-0.13300431793791673,2.7360399871461228E-7,3.2172027887617808E-7,3.2172027887617808E-7,{"$f":"IF($AA121<-'Results Dashboard'!$J$7,$AA121+'Results Dashboard'!$J$7,0)","v":-9.7974643625137026E-2},{"$f":"IF($AA121<-'Results Dashboard'!$J$8,$AA121+'Results Dashboard'!$J$8,0)","v":-6.2944969312357338E-2},{"$f":"IF($AA121<-'Results Dashboard'!$J$9,$AA121+'Results Dashboard'!$J$9,0)","v":-6.2944969312357338E-2},{"$f":"IF($AA121<-'Results Dashboard'!$J$11,$AA121+'Results Dashboard'!$J$11,0)","v":0},{"$f":"IF($AA121<-'Results Dashboard'!$J$10,$AA121+'Results Dashboard'!$J$10,0)","v":0},null,{"$f":"IF((X121+W121)>0,(X121+W121)*0.5*'User Parameters'!C$48,(X121+W121)*0.5*'User Parameters'!$C$49)","v":0},{"$f":"-'User Parameters'!$C$12*('User Parameters'!$C$13-1)","v":0},-0.13300431793791673]
[1.0500039253981059,454.54342697283204,477.27238258538097,1.0500039253981059,{"$f":"'User Parameters'!$C$10","v":40},{"$f":"B122*'User Parameters'!$C$14","v":0},-62.72895561254893,-0.1380043179379167,1.0500039253981059,{"$f":"IF(UP_RSBasis=\"MLR\",UP_RSTarget_MLR,IF(UP_RSBasis=\"Medical Baseline\",UP_RSTarget_Medlcal,0))","v":0},0,0,0,0,0,0,0,"",0,{"$f":"(S122+C122+'User Parameters'!$C$11)/(B122-F122)","v":1.0500039253981059},{"$f":"IF(T122<'User Parameters'!$J$5,'User Parameters'!$J$5,IF(T122>'User Parameters'!$J$6,'User Parameters'!$J$6,T122))","v":1.0500039253981059},0,0,{"$f":"(B122-C122-F122-E122-S122-V122)/'Results Dashboard'!$D$42","v":-0.1380043179379167},{"$f":"IF((X122+W122)>0,(X122+W122)*0.5*((1+'User Parameters'!C$48)^((12+UP_COC_WithholdLag)/12)-1),(X122+W122)*0.5*((1+'User Parameters'!$C$49)^((12+UP_COC_WithholdLag)/12)-1))","v":0},{"$f":"-'User Parameters'!$C$12*('User Parameters'!$C$13-1)","v":0},-0.1380043179379167,1.2297355201399739E-7,1.5063044670061488E-7,1.5063044670061488E-7,{"$f":"IF($AA122<-'Results Dashboard'!$J$7,$AA122+'Results Dashboard'!$J$7,0)","v":-0.102974643625137},{"$f":"IF($AA122<-'Results Dashboard'!$J$8,$AA122+'Results Dashboard'!$J$8,0)","v":-6.7944969312357315E-2},{"$f":"IF($AA122<-'Results Dashboard'!$J$9,$AA122+'Results Dashboard'!$J$9,0)","v":-6.7944969312357315E-2},{"$f":"IF($AA122<-'Results Dashboard'!$J$11,$AA122+'Results Dashboard'!$J$11,0)","v":0},{"$f":"IF($AA122<-'Results Dashboard'!$J$10,$AA122+'Results Dashboard'!$J$10,0)","v":0},null,{"$f":"IF((X122+W122)>0,(X122+W122)*0.5*'User Parameters'!C$48,(X122+W122)*0.5*'User Parameters'!$C$49)","v":0},{"$f":"-'User Parameters'!$C$12*('User Parameters'!$C$13-1)","v":0},-0.1380043179379167]
[1.0550039253981058,454.54342697283204,479.54509972024505,1.0550039253981058,{"$f":"'User Parameters'!$C$10","v":40},{"$f":"B123*'User Parameters'!$C$14","v":0},-65.001672747413011,-0.14300431793791651,1.0550039253981058,{"$f":"IF(UP_RSBasis=\"MLR\",UP_RSTarget_MLR,IF(UP_RSBasis=\"Medical Baseline\",UP_RSTarget_Medlcal,0))","v":0},0,0,0,0,0,0,0,"",0,{"$f":"(S123+C123+'User Parameters'!$C$11)/(B123-F123)","v":1.0550039253981058},{"$f":"IF(T123<'User Parameters'!$J$5,'User Parameters'!$J$5,IF(T123>'User Parameters'!$J$6,'User Parameters'!$J$6,T123))","v":1.0550039253981058},0,0,{"$f":"(B123-C123-F123-E123-S123-V123)/'Results Dashboard'!$D$42","v":-0.14300431793791651},{"$f":"IF((X123+W123)>0,(X123+W123)*0.5*((1+'User Parameters'!C$48)^((12+UP_COC_WithholdLag)/12)-1),(X123+W123)*0.5*((1+'User Parameters'!$C$49)^((12+UP_COC_WithholdLag)/12)-1))","v":0},{"$f":"-'User Parameters'!$C$12*('User Parameters'!$C$13-1)","v":0},-0.14300431793791651,5.405123367431744E-8,6.892231833967996E-8,6.892231833967996E-8,{"$f":"IF($AA123<-'Results Dashboard'!$J$7,$AA123+'Results Dashboard'!$J$7,0)","v":-0.10797464362513681},{"$f":"IF($AA123<-'Results Dashboard'!$J$8,$AA123+'Results Dashboard'!$J$8,0)","v":-7.2944969312357125E-2},{"$f":"IF($AA123<-'Results Dashboard'!$J$9,$AA123+'Results Dashboard'!$J$9,0)","v":-7.2944969312357125E-2},{"$f":"IF($AA123<-'Results Dashboard'!$J$11,$AA123+'Results Dashboard'!$J$11,0)","v":0},{"$f":"IF($AA123<-'Results Dashboard'!$J$10,$AA123+'Results Dashboard'!$J$10,0)","v":0},null,{"$f":"IF((X123+W123)>0,(X123+W123)*0.5*'User Parameters'!C$48,(X123+W123)*0.5*'User Parameters'!$C$49)","v":0},{"$f":"-'User Parameters'!$C$12*('User Parameters'!$C$13-1)","v":0},-0.14300431793791651]
[1.0600039253981057,454.54342697283204,481.81781685510919,1.0600039253981057,{"$f":"'User Parameters'!$C$10","v":40},{"$f":"B124*'User Parameters'!$C$14","v":0},-67.274389882277148,-0.14800431793791646,1.0600039253981057,{"$f":"IF(UP_RSBasis=\"MLR\",UP_RSTarget_MLR,IF(UP_RSBasis=\"Medical Baseline\",UP_RSTarget_Medlcal,0))","v":0},0,0,0,0,0,0,0,"",0,{"$f":"(S124+C124+'User Parameters'!$C$11)/(B124-F124)","v":1.0600039253981057},{"$f":"IF(T124<'User Parameters'!$J$5,'User Parameters'!$J$5,IF(T124>'User Parameters'!$J$6,'User Parameters'!$J$6,T124))","v":1.0600039253981057},0,0,{"$f":"(B124-C124-F124-E124-S124-V124)/'Results Dashboard'!$D$42","v":-0.14800431793791646},{"$f":"IF((X124+W124)>0,(X124+W124)*0.5*((1+'User Parameters'!C$48)^((12+UP_COC_WithholdLag)/12)-1),(X124+W124)*0.5*((1+'User Parameters'!$C$49)^((12+UP_COC_WithholdLag)/12)-1))","v":0},{"$f":"-'User Parameters'!$C$12*('User Parameters'!$C$13-1)","v":0},-0.14800431793791646,2.3232148461369066E-8,3.0819085212948375E-8,3.0819085212948375E-8,{"$f":"IF($AA124<-'Results Dashboard'!$J$7,$AA124+'Results Dashboard'!$J$7,0)","v":-0.11297464362513676},{"$f":"IF($AA124<-'Results Dashboard'!$J$8,$AA124+'Results Dashboard'!$J$8,0)","v":-7.7944969312357074E-2},{"$f":"IF($AA124<-'Results Dashboard'!$J$9,$AA124+'Results Dashboard'!$J$9,0)","v":-7.7944969312357074E-2},{"$f":"IF($AA124<-'Results Dashboard'!$J$11,$AA124+'Results Dashboard'!$J$11,0)","v":0},{"$f":"IF($AA124<-'Results Dashboard'!$J$10,$AA124+'Results Dashboard'!$J$10,0)","v":0},null,{"$f":"IF((X124+W124)>0,(X124+W124)*0.5*'User Parameters'!C$48,(X124+W124)*0.5*'User Parameters'!$C$49)","v":0},{"$f":"-'User Parameters'!$C$12*('User Parameters'!$C$13-1)","v":0},-0.14800431793791646]
[1.0650039253981056,454.54342697283204,484.09053398997327,1.0650039253981056,{"$f":"'User Parameters'!$C$10","v":40},{"$f":"B125*'User Parameters'!$C$14","v":0},-69.547107017141229,-0.1530043179379163,1.0650039253981056,{"$f":"IF(UP_RSBasis=\"MLR\",UP_RSTarget_MLR,IF(UP_RSBasis=\"Medical Baseline\",UP_RSTarget_Medlcal,0))","v":0},0,0,0,0,0,0,0,"",0,{"$f":"(S125+C125+'User Parameters'!$C$11)/(B125-F125)","v":1.0650039253981056},{"$f":"IF(T125<'User Parameters'!$J$5,'User Parameters'!$J$5,IF(T125>'User Parameters'!$J$6,'User Parameters'!$J$6,T125))","v":1.0650039253981056},0,0,{"$f":"(B125-C125-F125-E125-S125-V125)/'Results Dashboard'!$D$42","v":-0.1530043179379163},{"$f":"IF((X125+W125)>0,(X125+W125)*0.5*((1+'User Parameters'!C$48)^((12+UP_COC_WithholdLag)/12)-1),(X125+W125)*0.5*((1+'User Parameters'!$C$49)^((12+UP_COC_WithholdLag)/12)-1))","v":0},{"$f":"-'User Parameters'!$C$12*('User Parameters'!$C$13-1)","v":0},-0.1530043179379163,9.7644827204800976E-9,1.3467665740888968E-8,1.3467665740888968E-8,{"$f":"IF($AA125<-'Results Dashboard'!$J$7,$AA125+'Results Dashboard'!$J$7,0)","v":-0.1179746436251366},{"$f":"IF($AA125<-'Results Dashboard'!$J$8,$AA125+'Results Dashboard'!$J$8,0)","v":-8.2944969312356912E-2},{"$f":"IF($AA125<-'Results Dashboard'!$J$9,$AA125+'Results Dashboard'!$J$9,0)","v":-8.2944969312356912E-2},{"$f":"IF($AA125<-'Results Dashboard'!$J$11,$AA125+'Results Dashboard'!$J$11,0)","v":0},{"$f":"IF($AA125<-'Results Dashboard'!$J$10,$AA125+'Results Dashboard'!$J$10,0)","v":0},null,{"$f":"IF((X125+W125)>0,(X125+W125)*0.5*'User Parameters'!C$48,(X125+W125)*0.5*'User Parameters'!$C$49)","v":0},{"$f":"-'User Parameters'!$C$12*('User Parameters'!$C$13-1)","v":0},-0.1530043179379163]
[1.0700039253981055,454.54342697283204,486.3632511248374,1.0700039253981055,{"$f":"'User Parameters'!$C$10","v":40},{"$f":"B126*'User Parameters'!$C$14","v":0},-71.819824152005367,-0.15800431793791625,1.0700039253981055,{"$f":"IF(UP_RSBasis=\"MLR\",UP_RSTarget_MLR,IF(UP_RSBasis=\"Medical Baseline\",UP_RSTarget_Medlcal,0))","v":0},0,0,0,0,0,0,0,"",0,{"$f":"(S126+C126+'User Parameters'!$C$11)/(B126-F126)","v":1.0700039253981055},{"$f":"IF(T126<'User Parameters'!$J$5,'User Parameters'!$J$5,IF(T126>'User Parameters'!$J$6,'User Parameters'!$J$6,T126))","v":1.0700039253981055},0,0,{"$f":"(B126-C126-F126-E126-S126-V126)/'Results Dashboard'!$D$42","v":-0.15800431793791625},{"$f":"IF((X126+W126)>0,(X126+W126)*0.5*((1+'User Parameters'!C$48)^((12+UP_COC_WithholdLag)/12)-1),(X126+W126)*0.5*((1+'User Parameters'!$C$49)^((12+UP_COC_WithholdLag)/12)-1))","v":0},{"$f":"-'User Parameters'!$C$12*('User Parameters'!$C$13-1)","v":0},-0.15800431793791625,4.0130294103656049E-9,5.7514533101144926E-9,5.7514533101144926E-9,{"$f":"IF($AA126<-'Results Dashboard'!$J$7,$AA126+'Results Dashboard'!$J$7,0)","v":-0.12297464362513655},{"$f":"IF($AA126<-'Results Dashboard'!$J$8,$AA126+'Results Dashboard'!$J$8,0)","v":-8.794496931235686E-2},{"$f":"IF($AA126<-'Results Dashboard'!$J$9,$AA126+'Results Dashboard'!$J$9,0)","v":-8.794496931235686E-2},{"$f":"IF($AA126<-'Results Dashboard'!$J$11,$AA126+'Results Dashboard'!$J$11,0)","v":-3.7078353040762013E-4},{"$f":"IF($AA126<-'Results Dashboard'!$J$10,$AA126+'Results Dashboard'!$J$10,0)","v":-3.7078353040762013E-4},null,{"$f":"IF((X126+W126)>0,(X126+W126)*0.5*'User Parameters'!C$48,(X126+W126)*0.5*'User Parameters'!$C$49)","v":0},{"$f":"-'User Parameters'!$C$12*('User Parameters'!$C$13-1)","v":0},-0.15800431793791625]
[1.0750039253981054,454.54342697283204,488.63596825970149,1.0750039253981054,{"$f":"'User Parameters'!$C$10","v":40},{"$f":"B127*'User Parameters'!$C$14","v":0},-74.092541286869448,-0.16300431793791606,1.0750039253981054,{"$f":"IF(UP_RSBasis=\"MLR\",UP_RSTarget_MLR,IF(UP_RSBasis=\"Medical Baseline\",UP_RSTarget_Medlcal,0))","v":0},0,0,0,0,0,0,0,"",0,{"$f":"(S127+C127+'User Parameters'!$C$11)/(B127-F127)","v":1.0750039253981054},{"$f":"IF(T127<'User Parameters'!$J$5,'User Parameters'!$J$5,IF(T127>'User Parameters'!$J$6,'User Parameters'!$J$6,T127))","v":1.0750039253981054},0,0,{"$f":"(B127-C127-F127-E127-S127-V127)/'Results Dashboard'!$D$42","v":-0.16300431793791606},{"$f":"IF((X127+W127)>0,(X127+W127)*0.5*((1+'User Parameters'!C$48)^((12+UP_COC_WithholdLag)/12)-1),(X127+W127)*0.5*((1+'User Parameters'!$C$49)^((12+UP_COC_WithholdLag)/12)-1))","v":0},{"$f":"-'User Parameters'!$C$12*('User Parameters'!$C$13-1)","v":0},-0.16300431793791606,1.6126741857279786E-9,2.4003552246376265E-9,2.4003552246376265E-9,{"$f":"IF($AA127<-'Results Dashboard'!$J$7,$AA127+'Results Dashboard'!$J$7,0)","v":-0.12797464362513636},{"$f":"IF($AA127<-'Results Dashboard'!$J$8,$AA127+'Results Dashboard'!$J$8,0)","v":-9.2944969312356671E-2},{"$f":"IF($AA127<-'Results Dashboard'!$J$9,$AA127+'Results Dashboard'!$J$9,0)","v":-9.2944969312356671E-2},{"$f":"IF($AA127<-'Results Dashboard'!$J$11,$AA127+'Results Dashboard'!$J$11,0)","v":-5.3707835304074303E-3},{"$f":"IF($AA127<-'Results Dashboard'!$J$10,$AA127+'Results Dashboard'!$J$10,0)","v":-5.3707835304074303E-3},null,{"$f":"IF((X127+W127)>0,(X127+W127)*0.5*'User Parameters'!C$48,(X127+W127)*0.5*'User Parameters'!$C$49)","v":0},{"$f":"-'User Parameters'!$C$12*('User Parameters'!$C$13-1)","v":0},-0.16300431793791606]
[1.0800039253981053,454.54342697283204,490.90868539456562,1.0800039253981053,{"$f":"'User Parameters'!$C$10","v":40},{"$f":"B128*'User Parameters'!$C$14","v":0},-76.365258421733586,-0.16800431793791601,1.0800039253981053,{"$f":"IF(UP_RSBasis=\"MLR\",UP_RSTarget_MLR,IF(UP_RSBasis=\"Medical Baseline\",UP_RSTarget_Medlcal,0))","v":0},0,0,0,0,0,0,0,"",0,{"$f":"(S128+C128+'User Parameters'!$C$11)/(B128-F128)","v":1.0800039253981053},{"$f":"IF(T128<'User Parameters'!$J$5,'User Parameters'!$J$5,IF(T128>'User Parameters'!$J$6,'User Parameters'!$J$6,T128))","v":1.0800039253981053},0,0,{"$f":"(B128-C128-F128-E128-S128-V128)/'Results Dashboard'!$D$42","v":-0.16800431793791601},{"$f":"IF((X128+W128)>0,(X128+W128)*0.5*((1+'User Parameters'!C$48)^((12+UP_COC_WithholdLag)/12)-1),(X128+W128)*0.5*((1+'User Parameters'!$C$49)^((12+UP_COC_WithholdLag)/12)-1))","v":0},{"$f":"-'User Parameters'!$C$12*('User Parameters'!$C$13-1)","v":0},-0.16800431793791601,6.3366662049867543E-10,9.7900756522930328E-10,9.7900756522930328E-10,{"$f":"IF($AA128<-'Results Dashboard'!$J$7,$AA128+'Results Dashboard'!$J$7,0)","v":-0.13297464362513631},{"$f":"IF($AA128<-'Results Dashboard'!$J$8,$AA128+'Results Dashboard'!$J$8,0)","v":-9.794496931235662E-2},{"$f":"IF($AA128<-'Results Dashboard'!$J$9,$AA128+'Results Dashboard'!$J$9,0)","v":-9.794496931235662E-2},{"$f":"IF($AA128<-'Results Dashboard'!$J$11,$AA128+'Results Dashboard'!$J$11,0)","v":-1.0370783530407379E-2},{"$f":"IF($AA128<-'Results Dashboard'!$J$10,$AA128+'Results Dashboard'!$J$10,0)","v":-1.0370783530407379E-2},null,{"$f":"IF((X128+W128)>0,(X128+W128)*0.5*'User Parameters'!C$48,(X128+W128)*0.5*'User Parameters'!$C$49)","v":0},{"$f":"-'User Parameters'!$C$12*('User Parameters'!$C$13-1)","v":0},-0.16800431793791601]
[{"$f":"A128+0.005","v":1.0850039253981052},454.54342697283204,493.1814025294297,1.0850039253981052,{"$f":"'User Parameters'!$C$10","v":40},{"$f":"B129*'User Parameters'!$C$14","v":0},-78.637975556597667,-0.17300431793791585,1.0850039253981052,{"$f":"IF(UP_RSBasis=\"MLR\",UP_RSTarget_MLR,IF(UP_RSBasis=\"Medical Baseline\",UP_RSTarget_Medlcal,0))","v":0},0,0,0,0,0,0,0,"",0,{"$f":"(S129+C129+'User Parameters'!$C$11)/(B129-F129)","v":1.0850039253981052},{"$f":"IF(T129<'User Parameters'!$J$5,'User Parameters'!$J$5,IF(T129>'User Parameters'!$J$6,'User Parameters'!$J$6,T129))","v":1.0850039253981052},0,0,{"$f":"(B129-C129-F129-E129-S129-V129)/'Results Dashboard'!$D$42","v":-0.17300431793791585},{"$f":"IF((X129+W129)>0,(X129+W129)*0.5*((1+'User Parameters'!C$48)^((12+UP_COC_WithholdLag)/12)-1),(X129+W129)*0.5*((1+'User Parameters'!$C$49)^((12+UP_COC_WithholdLag)/12)-1))","v":0},{"$f":"-'User Parameters'!$C$12*('User Parameters'!$C$13-1)","v":0},-0.17300431793791585,2.4344695370218164E-10,3.9021966679649379E-10,3.9021966679649379E-10,{"$f":"IF($AA129<-'Results Dashboard'!$J$7,$AA129+'Results Dashboard'!$J$7,0)","v":-0.13797464362513615},{"$f":"IF($AA129<-'Results Dashboard'!$J$8,$AA129+'Results Dashboard'!$J$8,0)","v":-0.10294496931235646},{"$f":"IF($AA129<-'Results Dashboard'!$J$9,$AA129+'Results Dashboard'!$J$9,0)","v":-0.10294496931235646},{"$f":"IF($AA129<-'Results Dashboard'!$J$11,$AA129+'Results Dashboard'!$J$11,0)","v":-1.5370783530407217E-2},{"$f":"IF($AA129<-'Results Dashboard'!$J$10,$AA129+'Results Dashboard'!$J$10,0)","v":-1.5370783530407217E-2},null,{"$f":"IF((X129+W129)>0,(X129+W129)*0.5*'User Parameters'!C$48,(X129+W129)*0.5*'User Parameters'!$C$49)","v":0},{"$f":"-'User Parameters'!$C$12*('User Parameters'!$C$13-1)","v":0},-0.17300431793791585]
[1.0900039253981051,454.54342697283204,495.45411966429384,1.0900039253981051,{"$f":"'User Parameters'!$C$10","v":40},{"$f":"B130*'User Parameters'!$C$14","v":0},-80.910692691461804,-0.1780043179379158,1.0900039253981051,{"$f":"IF(UP_RSBasis=\"MLR\",UP_RSTarget_MLR,IF(UP_RSBasis=\"Medical Baseline\",UP_RSTarget_Medlcal,0))","v":0},0,0,0,0,0,0,0,"",0,{"$f":"(S130+C130+'User Parameters'!$C$11)/(B130-F130)","v":1.0900039253981051},{"$f":"IF(T130<'User Parameters'!$J$5,'User Parameters'!$J$5,IF(T130>'User Parameters'!$J$6,'User Parameters'!$J$6,T130))","v":1.0900039253981051},0,0,{"$f":"(B130-C130-F130-E130-S130-V130)/'Results Dashboard'!$D$42","v":-0.1780043179379158},{"$f":"IF((X130+W130)>0,(X130+W130)*0.5*((1+'User Parameters'!C$48)^((12+UP_COC_WithholdLag)/12)-1),(X130+W130)*0.5*((1+'User Parameters'!$C$49)^((12+UP_COC_WithholdLag)/12)-1))","v":0},{"$f":"-'User Parameters'!$C$12*('User Parameters'!$C$13-1)","v":0},-0.1780043179379158,9.1446530629067862E-11,1.5200042307311378E-10,1.5200042307311378E-10,{"$f":"IF($AA130<-'Results Dashboard'!$J$7,$AA130+'Results Dashboard'!$J$7,0)","v":-0.14297464362513609},{"$f":"IF($AA130<-'Results Dashboard'!$J$8,$AA130+'Results Dashboard'!$J$8,0)","v":-0.10794496931235641},{"$f":"IF($AA130<-'Results Dashboard'!$J$9,$AA130+'Results Dashboard'!$J$9,0)","v":-0.10794496931235641},{"$f":"IF($AA130<-'Results Dashboard'!$J$11,$AA130+'Results Dashboard'!$J$11,0)","v":-2.0370783530407166E-2},{"$f":"IF($AA130<-'Results Dashboard'!$J$10,$AA130+'Results Dashboard'!$J$10,0)","v":-2.0370783530407166E-2},null,{"$f":"IF((X130+W130)>0,(X130+W130)*0.5*'User Parameters'!C$48,(X130+W130)*0.5*'User Parameters'!$C$49)","v":0},{"$f":"-'User Parameters'!$C$12*('User Parameters'!$C$13-1)","v":0},-0.1780043179379158]
[1.095003925398105,454.54342697283204,497.72683679915798,1.095003925398105,{"$f":"'User Parameters'!$C$10","v":40},{"$f":"B131*'User Parameters'!$C$14","v":0},-83.183409826325942,-0.18300431793791574,1.095003925398105,{"$f":"IF(UP_RSBasis=\"MLR\",UP_RSTarget_MLR,IF(UP_RSBasis=\"Medical Baseline\",UP_RSTarget_Medlcal,0))","v":0},0,0,0,0,0,0,0,"",0,{"$f":"(S131+C131+'User Parameters'!$C$11)/(B131-F131)","v":1.095003925398105},{"$f":"IF(T131<'User Parameters'!$J$5,'User Parameters'!$J$5,IF(T131>'User Parameters'!$J$6,'User Parameters'!$J$6,T131))","v":1.095003925398105},0,0,{"$f":"(B131-C131-F131-E131-S131-V131)/'Results Dashboard'!$D$42","v":-0.18300431793791574},{"$f":"IF((X131+W131)>0,(X131+W131)*0.5*((1+'User Parameters'!C$48)^((12+UP_COC_WithholdLag)/12)-1),(X131+W131)*0.5*((1+'User Parameters'!$C$49)^((12+UP_COC_WithholdLag)/12)-1))","v":0},{"$f":"-'User Parameters'!$C$12*('User Parameters'!$C$13-1)","v":0},-0.18300431793791574,3.3584597651427602E-11,5.786193297764026E-11,5.786193297764026E-11,{"$f":"IF($AA131<-'Results Dashboard'!$J$7,$AA131+'Results Dashboard'!$J$7,0)","v":-0.14797464362513604},{"$f":"IF($AA131<-'Results Dashboard'!$J$8,$AA131+'Results Dashboard'!$J$8,0)","v":-0.11294496931235636},{"$f":"IF($AA131<-'Results Dashboard'!$J$9,$AA131+'Results Dashboard'!$J$9,0)","v":-0.11294496931235636},{"$f":"IF($AA131<-'Results Dashboard'!$J$11,$AA131+'Results Dashboard'!$J$11,0)","v":-2.5370783530407115E-2},{"$f":"IF($AA131<-'Results Dashboard'!$J$10,$AA131+'Results Dashboard'!$J$10,0)","v":-2.5370783530407115E-2},null,{"$f":"IF((X131+W131)>0,(X131+W131)*0.5*'User Parameters'!C$48,(X131+W131)*0.5*'User Parameters'!$C$49)","v":0},{"$f":"-'User Parameters'!$C$12*('User Parameters'!$C$13-1)","v":0},-0.18300431793791574]
[1.1000039253981049,454.54342697283204,499.99955393402206,1.1000039253981049,{"$f":"'User Parameters'!$C$10","v":40},{"$f":"B132*'User Parameters'!$C$14","v":0},-85.456126961190023,-0.18800431793791558,1.1000039253981049,{"$f":"IF(UP_RSBasis=\"MLR\",UP_RSTarget_MLR,IF(UP_RSBasis=\"Medical Baseline\",UP_RSTarget_Medlcal,0))","v":0},0,0,0,0,0,0,0,"",0,{"$f":"(S132+C132+'User Parameters'!$C$11)/(B132-F132)","v":1.1000039253981049},{"$f":"IF(T132<'User Parameters'!$J$5,'User Parameters'!$J$5,IF(T132>'User Parameters'!$J$6,'User Parameters'!$J$6,T132))","v":1.1000039253981049},0,0,{"$f":"(B132-C132-F132-E132-S132-V132)/'Results Dashboard'!$D$42","v":-0.18800431793791558},{"$f":"IF((X132+W132)>0,(X132+W132)*0.5*((1+'User Parameters'!C$48)^((12+UP_COC_WithholdLag)/12)-1),(X132+W132)*0.5*((1+'User Parameters'!$C$49)^((12+UP_COC_WithholdLag)/12)-1))","v":0},{"$f":"-'User Parameters'!$C$12*('User Parameters'!$C$13-1)","v":0},-0.18800431793791558,1.2059083308869936E-11,2.1525514342557668E-11,2.1525514342557668E-11,{"$f":"IF($AA132<-'Results Dashboard'!$J$7,$AA132+'Results Dashboard'!$J$7,0)","v":-0.15297464362513588},{"$f":"IF($AA132<-'Results Dashboard'!$J$8,$AA132+'Results Dashboard'!$J$8,0)","v":-0.11794496931235619},{"$f":"IF($AA132<-'Results Dashboard'!$J$9,$AA132+'Results Dashboard'!$J$9,0)","v":-0.11794496931235619},{"$f":"IF($AA132<-'Results Dashboard'!$J$11,$AA132+'Results Dashboard'!$J$11,0)","v":-3.0370783530406953E-2},{"$f":"IF($AA132<-'Results Dashboard'!$J$10,$AA132+'Results Dashboard'!$J$10,0)","v":-3.0370783530406953E-2},null,{"$f":"IF((X132+W132)>0,(X132+W132)*0.5*'User Parameters'!C$48,(X132+W132)*0.5*'User Parameters'!$C$49)","v":0},{"$f":"-'User Parameters'!$C$12*('User Parameters'!$C$13-1)","v":0},-0.18800431793791558]
[1.1050039253981048,454.54342697283204,502.2722710688862,1.1050039253981048,{"$f":"'User Parameters'!$C$10","v":40},{"$f":"B133*'User Parameters'!$C$14","v":0},-87.728844096054161,-0.19300431793791553,1.1050039253981048,{"$f":"IF(UP_RSBasis=\"MLR\",UP_RSTarget_MLR,IF(UP_RSBasis=\"Medical Baseline\",UP_RSTarget_Medlcal,0))","v":0},0,0,0,0,0,0,0,"",0,{"$f":"(S133+C133+'User Parameters'!$C$11)/(B133-F133)","v":1.1050039253981048},{"$f":"IF(T133<'User Parameters'!$J$5,'User Parameters'!$J$5,IF(T133>'User Parameters'!$J$6,'User Parameters'!$J$6,T133))","v":1.1050039253981048},0,0,{"$f":"(B133-C133-F133-E133-S133-V133)/'Results Dashboard'!$D$42","v":-0.19300431793791553},{"$f":"IF((X133+W133)>0,(X133+W133)*0.5*((1+'User Parameters'!C$48)^((12+UP_COC_WithholdLag)/12)-1),(X133+W133)*0.5*((1+'User Parameters'!$C$49)^((12+UP_COC_WithholdLag)/12)-1))","v":0},{"$f":"-'User Parameters'!$C$12*('User Parameters'!$C$13-1)","v":0},-0.19300431793791553,4.2333227643040716E-12,7.8257605445658635E-12,7.8257605445658635E-12,{"$f":"IF($AA133<-'Results Dashboard'!$J$7,$AA133+'Results Dashboard'!$J$7,0)","v":-0.15797464362513583},{"$f":"IF($AA133<-'Results Dashboard'!$J$8,$AA133+'Results Dashboard'!$J$8,0)","v":-0.12294496931235614},{"$f":"IF($AA133<-'Results Dashboard'!$J$9,$AA133+'Results Dashboard'!$J$9,0)","v":-0.12294496931235614},{"$f":"IF($AA133<-'Results Dashboard'!$J$11,$AA133+'Results Dashboard'!$J$11,0)","v":-3.5370783530406902E-2},{"$f":"IF($AA133<-'Results Dashboard'!$J$10,$AA133+'Results Dashboard'!$J$10,0)","v":-3.5370783530406902E-2},null,{"$f":"IF((X133+W133)>0,(X133+W133)*0.5*'User Parameters'!C$48,(X133+W133)*0.5*'User Parameters'!$C$49)","v":0},{"$f":"-'User Parameters'!$C$12*('User Parameters'!$C$13-1)","v":0},-0.19300431793791553]
[1.1100039253981047,454.54342697283204,504.54498820375028,1.1100039253981047,{"$f":"'User Parameters'!$C$10","v":40},{"$f":"B134*'User Parameters'!$C$14","v":0},-90.001561230918242,-0.19800431793791534,1.1100039253981047,{"$f":"IF(UP_RSBasis=\"MLR\",UP_RSTarget_MLR,IF(UP_RSBasis=\"Medical Baseline\",UP_RSTarget_Medlcal,0))","v":0},0,0,0,0,0,0,0,"",0,{"$f":"(S134+C134+'User Parameters'!$C$11)/(B134-F134)","v":1.1100039253981047},{"$f":"IF(T134<'User Parameters'!$J$5,'User Parameters'!$J$5,IF(T134>'User Parameters'!$J$6,'User Parameters'!$J$6,T134))","v":1.1100039253981047},0,0,{"$f":"(B134-C134-F134-E134-S134-V134)/'Results Dashboard'!$D$42","v":-0.19800431793791534},{"$f":"IF((X134+W134)>0,(X134+W134)*0.5*((1+'User Parameters'!C$48)^((12+UP_COC_WithholdLag)/12)-1),(X134+W134)*0.5*((1+'User Parameters'!$C$49)^((12+UP_COC_WithholdLag)/12)-1))","v":0},{"$f":"-'User Parameters'!$C$12*('User Parameters'!$C$13-1)","v":0},-0.19800431793791534,1.4528928701199043E-12,2.7804298941841675E-12,2.7804298941841675E-12,{"$f":"IF($AA134<-'Results Dashboard'!$J$7,$AA134+'Results Dashboard'!$J$7,0)","v":-0.16297464362513564},{"$f":"IF($AA134<-'Results Dashboard'!$J$8,$AA134+'Results Dashboard'!$J$8,0)","v":-0.12794496931235594},{"$f":"IF($AA134<-'Results Dashboard'!$J$9,$AA134+'Results Dashboard'!$J$9,0)","v":-0.12794496931235594},{"$f":"IF($AA134<-'Results Dashboard'!$J$11,$AA134+'Results Dashboard'!$J$11,0)","v":-4.0370783530406712E-2},{"$f":"IF($AA134<-'Results Dashboard'!$J$10,$AA134+'Results Dashboard'!$J$10,0)","v":-4.0370783530406712E-2},null,{"$f":"IF((X134+W134)>0,(X134+W134)*0.5*'User Parameters'!C$48,(X134+W134)*0.5*'User Parameters'!$C$49)","v":0},{"$f":"-'User Parameters'!$C$12*('User Parameters'!$C$13-1)","v":0},-0.19800431793791534]
[1.1150039253981046,454.54342697283204,506.81770533861442,1.1150039253981046,{"$f":"'User Parameters'!$C$10","v":40},{"$f":"B135*'User Parameters'!$C$14","v":0},-92.274278365782379,-0.20300431793791529,1.1150039253981046,{"$f":"IF(UP_RSBasis=\"MLR\",UP_RSTarget_MLR,IF(UP_RSBasis=\"Medical Baseline\",UP_RSTarget_Medlcal,0))","v":0},0,0,0,0,0,0,0,"",0,{"$f":"(S135+C135+'User Parameters'!$C$11)/(B135-F135)","v":1.1150039253981046},{"$f":"IF(T135<'User Parameters'!$J$5,'User Parameters'!$J$5,IF(T135>'User Parameters'!$J$6,'User Parameters'!$J$6,T135))","v":1.1150039253981046},0,0,{"$f":"(B135-C135-F135-E135-S135-V135)/'Results Dashboard'!$D$42","v":-0.20300431793791529},{"$f":"IF((X135+W135)>0,(X135+W135)*0.5*((1+'User Parameters'!C$48)^((12+UP_COC_WithholdLag)/12)-1),(X135+W135)*0.5*((1+'User Parameters'!$C$49)^((12+UP_COC_WithholdLag)/12)-1))","v":0},{"$f":"-'User Parameters'!$C$12*('User Parameters'!$C$13-1)","v":0},-0.20300431793791529,4.8748757187365562E-13,9.654052982462488E-13,9.654052982462488E-13,{"$f":"IF($AA135<-'Results Dashboard'!$J$7,$AA135+'Results Dashboard'!$J$7,0)","v":-0.16797464362513559},{"$f":"IF($AA135<-'Results Dashboard'!$J$8,$AA135+'Results Dashboard'!$J$8,0)","v":-0.13294496931235589},{"$f":"IF($AA135<-'Results Dashboard'!$J$9,$AA135+'Results Dashboard'!$J$9,0)","v":-0.13294496931235589},{"$f":"IF($AA135<-'Results Dashboard'!$J$11,$AA135+'Results Dashboard'!$J$11,0)","v":-4.5370783530406661E-2},{"$f":"IF($AA135<-'Results Dashboard'!$J$10,$AA135+'Results Dashboard'!$J$10,0)","v":-4.5370783530406661E-2},null,{"$f":"IF((X135+W135)>0,(X135+W135)*0.5*'User Parameters'!C$48,(X135+W135)*0.5*'User Parameters'!$C$49)","v":0},{"$f":"-'User Parameters'!$C$12*('User Parameters'!$C$13-1)","v":0},-0.20300431793791529]
[1.1200039253981044,454.54342697283204,509.0904224734785,1.1200039253981044,{"$f":"'User Parameters'!$C$10","v":40},{"$f":"B136*'User Parameters'!$C$14","v":0},-94.54699550064646,-0.20800431793791513,1.1200039253981044,{"$f":"IF(UP_RSBasis=\"MLR\",UP_RSTarget_MLR,IF(UP_RSBasis=\"Medical Baseline\",UP_RSTarget_Medlcal,0))","v":0},{"$f":"IF(UP_RSBasis=\"MLR\",J136-I136,IF(UP_RSBasis=\"Medical Baseline\",J136-$C136,0))","v":0},0,0,0,0,0,0,{"$f":"IF(UP_RSBasis=\"MLR\",SUMPRODUCT(L$4:Q$4,L136:Q136),\"\")","v":""},{"$f":"IF(UP_RSBasis=\"MLR\",R136*(B136-F136),SUMPRODUCT($L$4:$Q$4,$L136:$Q136))","v":0},{"$f":"(S136+C136+'User Parameters'!$C$11)/(B136-F136)","v":1.1200039253981044},{"$f":"IF(T136<'User Parameters'!$J$5,'User Parameters'!$J$5,IF(T136>'User Parameters'!$J$6,'User Parameters'!$J$6,T136))","v":1.1200039253981044},{"$f":"(U136-T136)*(B136-F136)","v":0},{"$f":"V136/B136","v":0},{"$f":"(B136-C136-F136-E136-S136-V136)/'Results Dashboard'!$D$42","v":-0.20800431793791513},{"$f":"IF((X136+W136)>0,(X136+W136)*0.5*((1+'User Parameters'!C$48)^((12+UP_COC_WithholdLag)/12)-1),(X136+W136)*0.5*((1+'User Parameters'!$C$49)^((12+UP_COC_WithholdLag)/12)-1))","v":0},{"$f":"-'User Parameters'!$C$12*('User Parameters'!$C$13-1)","v":0},-0.20800431793791513,{"$f":"_xlfn.NORM.DIST(H136,$AD$2,$AD$3,TRUE)","v":1.5990582214035376E-13},3.2758174973330186E-13,3.2758174973330186E-13,{"$f":"IF($AA136<-'Results Dashboard'!$J$7,$AA136+'Results Dashboard'!$J$7,0)","v":-0.17297464362513543},{"$f":"IF($AA136<-'Results Dashboard'!$J$8,$AA136+'Results Dashboard'!$J$8,0)","v":-0.13794496931235573},{"$f":"IF($AA136<-'Results Dashboard'!$J$9,$AA136+'Results Dashboard'!$J$9,0)","v":-0.13794496931235573},{"$f":"IF($AA136<-'Results Dashboard'!$J$11,$AA136+'Results Dashboard'!$J$11,0)","v":-5.0370783530406499E-2},{"$f":"IF($AA136<-'Results Dashboard'!$J$10,$AA136+'Results Dashboard'!$J$10,0)","v":-5.0370783530406499E-2},null,{"$f":"IF((X136+W136)>0,(X136+W136)*0.5*'User Parameters'!C$48,(X136+W136)*0.5*'User Parameters'!$C$49)","v":0},{"$f":"-'User Parameters'!$C$12*('User Parameters'!$C$13-1)","v":0},-0.20800431793791513]
[1.1250039253981043,454.54342697283204,{"$f":"B137*A137","v":511.36313960834264},{"$f":"(C137)/(B137)","v":1.1250039253981043},{"$f":"'User Parameters'!$C$10","v":40},{"$f":"B137*'User Parameters'!$C$14","v":0},{"$f":"B137-E137-C137-F137","v":-96.819712635510598},{"$f":"G137/B137","v":-0.21300431793791508},1.1250039253981043,{"$f":"IF(UP_RSBasis=\"MLR\",UP_RSTarget_MLR,IF(UP_RSBasis=\"Medical Baseline\",UP_RSTarget_Medlcal,0))","v":0},0,{"$f":"IF($K137>0,MIN(J137*L$3-J137*L$2,$K137-M137-N137),0)","v":0},{"$f":"IF($K137>0,MIN(J137*M$3-J137*M$2,$K137-N137),0)","v":0},{"$f":"IF($K137>0,MIN(J137*N$3-J137*N$2,$K137),0)","v":0},{"$f":"IF($K137<0,MAX(J137*O$2-J137*O$3,$K137),0)","v":0},{"$f":"IF($K137<0,MAX(J137*P$2-J137*P$3,$K137-O137),0)","v":0},{"$f":"IF($K137<0,MAX(J137*Q$2-J137*Q$3,$K137-P137-O137),0)","v":0},"",0,{"$f":"(S137+C137+'User Parameters'!$C$11)/(B137-F137)","v":1.1250039253981043},{"$f":"IF(T137<'User Parameters'!$J$5,'User Parameters'!$J$5,IF(T137>'User Parameters'!$J$6,'User Parameters'!$J$6,T137))","v":1.1250039253981043},0,0,{"$f":"(B137-C137-F137-E137-S137-V137)/'Results Dashboard'!$D$42","v":-0.21300431793791508},{"$f":"IF((X137+W137)>0,(X137+W137)*0.5*((1+'User Parameters'!C$48)^((12+UP_COC_WithholdLag)/12)-1),(X137+W137)*0.5*((1+'User Parameters'!$C$49)^((12+UP_COC_WithholdLag)/12)-1))","v":0},{"$f":"-'User Parameters'!$C$12*('User Parameters'!$C$13-1)","v":0},{"$f":"Y137+X137-Z137","v":-0.21300431793791508},5.127777634826447E-14,1.0862804579208928E-13,1.0862804579208928E-13,{"$f":"IF($AA137<-'Results Dashboard'!$J$7,$AA137+'Results Dashboard'!$J$7,0)","v":-0.17797464362513538},{"$f":"IF($AA137<-'Results Dashboard'!$J$8,$AA137+'Results Dashboard'!$J$8,0)","v":-0.14294496931235567},{"$f":"IF($AA137<-'Results Dashboard'!$J$9,$AA137+'Results Dashboard'!$J$9,0)","v":-0.14294496931235567},{"$f":"IF($AA137<-'Results Dashboard'!$J$11,$AA137+'Results Dashboard'!$J$11,0)","v":-5.5370783530406448E-2},{"$f":"IF($AA137<-'Results Dashboard'!$J$10,$AA137+'Results Dashboard'!$J$10,0)","v":-5.5370783530406448E-2},null,{"$f":"IF((X137+W137)>0,(X137+W137)*0.5*'User Parameters'!C$48,(X137+W137)*0.5*'User Parameters'!$C$49)","v":0},{"$f":"-'User Parameters'!$C$12*('User Parameters'!$C$13-1)","v":0},{"$f":"-AK137+X137-AL137","v":-0.21300431793791508}]
[1.1300039253981042,454.54342697283204,513.63585674320677,1.1300039253981042,{"$f":"'User Parameters'!$C$10","v":40},{"$f":"B138*'User Parameters'!$C$14","v":0},-99.092429770374736,-0.21800431793791503,1.1300039253981042,{"$f":"IF(UP_RSBasis=\"MLR\",UP_RSTarget_MLR,IF(UP_RSBasis=\"Medical Baseline\",UP_RSTarget_Medlcal,0))","v":0},0,0,0,0,0,0,0,"",0,{"$f":"(S138+C138+'User Parameters'!$C$11)/(B138-F138)","v":1.1300039253981042},{"$f":"IF(T138<'User Parameters'!$J$5,'User Parameters'!$J$5,IF(T138>'User Parameters'!$J$6,'User Parameters'!$J$6,T138))","v":1.1300039253981042},0,0,{"$f":"(B138-C138-F138-E138-S138-V138)/'Results Dashboard'!$D$42","v":-0.21800431793791503},{"$f":"IF((X138+W138)>0,(X138+W138)*0.5*((1+'User Parameters'!C$48)^((12+UP_COC_WithholdLag)/12)-1),(X138+W138)*0.5*((1+'User Parameters'!$C$49)^((12+UP_COC_WithholdLag)/12)-1))","v":0},{"$f":"-'User Parameters'!$C$12*('User Parameters'!$C$13-1)","v":0},-0.21800431793791503,1.6075038725638632E-14,3.5202737622625834E-14,{"$f":"AC138","v":3.5202737622625834E-14},{"$f":"IF($AA138<-'Results Dashboard'!$J$7,$AA138+'Results Dashboard'!$J$7,0)","v":-0.18297464362513532},{"$f":"IF($AA138<-'Results Dashboard'!$J$8,$AA138+'Results Dashboard'!$J$8,0)","v":-0.14794496931235562},{"$f":"IF($AA138<-'Results Dashboard'!$J$9,$AA138+'Results Dashboard'!$J$9,0)","v":-0.14794496931235562},{"$f":"IF($AA138<-'Results Dashboard'!$J$11,$AA138+'Results Dashboard'!$J$11,0)","v":-6.0370783530406397E-2},{"$f":"IF($AA138<-'Results Dashboard'!$J$10,$AA138+'Results Dashboard'!$J$10,0)","v":-6.0370783530406397E-2},null,{"$f":"IF((X138+W138)>0,(X138+W138)*0.5*'User Parameters'!C$48,(X138+W138)*0.5*'User Parameters'!$C$49)","v":0},{"$f":"-'User Parameters'!$C$12*('User Parameters'!$C$13-1)","v":0},-0.21800431793791503]
[1.1350039253981041,454.54342697283204,515.9085738780708,1.1350039253981041,{"$f":"'User Parameters'!$C$10","v":40},{"$f":"B139*'User Parameters'!$C$14","v":0},-101.36514690523876,-0.22300431793791473,1.1350039253981041,{"$f":"IF(UP_RSBasis=\"MLR\",UP_RSTarget_MLR,IF(UP_RSBasis=\"Medical Baseline\",UP_RSTarget_Medlcal,0))","v":0},0,0,0,0,0,0,0,"",0,{"$f":"(S139+C139+'User Parameters'!$C$11)/(B139-F139)","v":1.1350039253981041},{"$f":"IF(T139<'User Parameters'!$J$5,'User Parameters'!$J$5,IF(T139>'User Parameters'!$J$6,'User Parameters'!$J$6,T139))","v":1.1350039253981041},0,0,{"$f":"(B139-C139-F139-E139-S139-V139)/'Results Dashboard'!$D$42","v":-0.22300431793791473},{"$f":"IF((X139+W139)>0,(X139+W139)*0.5*((1+'User Parameters'!C$48)^((12+UP_COC_WithholdLag)/12)-1),(X139+W139)*0.5*((1+'User Parameters'!$C$49)^((12+UP_COC_WithholdLag)/12)-1))","v":0},{"$f":"-'User Parameters'!$C$12*('User Parameters'!$C$13-1)","v":0},-0.22300431793791473,4.9263685032015138E-15,1.1148670222437118E-14,1.1148670222437118E-14,{"$f":"IF($AA139<-'Results Dashboard'!$J$7,$AA139+'Results Dashboard'!$J$7,0)","v":-0.18797464362513502},{"$f":"IF($AA139<-'Results Dashboard'!$J$8,$AA139+'Results Dashboard'!$J$8,0)","v":-0.15294496931235535},{"$f":"IF($AA139<-'Results Dashboard'!$J$9,$AA139+'Results Dashboard'!$J$9,0)","v":-0.15294496931235535},{"$f":"IF($AA139<-'Results Dashboard'!$J$11,$AA139+'Results Dashboard'!$J$11,0)","v":-6.5370783530406096E-2},{"$f":"IF($AA139<-'Results Dashboard'!$J$10,$AA139+'Results Dashboard'!$J$10,0)","v":-6.5370783530406096E-2},null,{"$f":"IF((X139+W139)>0,(X139+W139)*0.5*'User Parameters'!C$48,(X139+W139)*0.5*'User Parameters'!$C$49)","v":0},{"$f":"-'User Parameters'!$C$12*('User Parameters'!$C$13-1)","v":0},-0.22300431793791473]
[1.140003925398104,454.54342697283204,518.18129101293493,1.140003925398104,{"$f":"'User Parameters'!$C$10","v":40},{"$f":"B140*'User Parameters'!$C$14","v":0},-103.6378640401029,-0.22800431793791467,1.140003925398104,{"$f":"IF(UP_RSBasis=\"MLR\",UP_RSTarget_MLR,IF(UP_RSBasis=\"Medical Baseline\",UP_RSTarget_Medlcal,0))","v":0},0,0,0,0,0,0,0,"",0,{"$f":"(S140+C140+'User Parameters'!$C$11)/(B140-F140)","v":1.140003925398104},{"$f":"IF(T140<'User Parameters'!$J$5,'User Parameters'!$J$5,IF(T140>'User Parameters'!$J$6,'User Parameters'!$J$6,T140))","v":1.140003925398104},0,0,{"$f":"(B140-C140-F140-E140-S140-V140)/'Results Dashboard'!$D$42","v":-0.22800431793791467},{"$f":"IF((X140+W140)>0,(X140+W140)*0.5*((1+'User Parameters'!C$48)^((12+UP_COC_WithholdLag)/12)-1),(X140+W140)*0.5*((1+'User Parameters'!$C$49)^((12+UP_COC_WithholdLag)/12)-1))","v":0},{"$f":"-'User Parameters'!$C$12*('User Parameters'!$C$13-1)","v":0},-0.22800431793791467,1.4758702462382513E-15,3.4504982569632625E-15,3.4504982569632625E-15,{"$f":"IF($AA140<-'Results Dashboard'!$J$7,$AA140+'Results Dashboard'!$J$7,0)","v":-0.19297464362513497},{"$f":"IF($AA140<-'Results Dashboard'!$J$8,$AA140+'Results Dashboard'!$J$8,0)","v":-0.1579449693123553},{"$f":"IF($AA140<-'Results Dashboard'!$J$9,$AA140+'Results Dashboard'!$J$9,0)","v":-0.1579449693123553},{"$f":"IF($AA140<-'Results Dashboard'!$J$11,$AA140+'Results Dashboard'!$J$11,0)","v":-7.0370783530406045E-2},{"$f":"IF($AA140<-'Results Dashboard'!$J$10,$AA140+'Results Dashboard'!$J$10,0)","v":-7.0370783530406045E-2},null,{"$f":"IF((X140+W140)>0,(X140+W140)*0.5*'User Parameters'!C$48,(X140+W140)*0.5*'User Parameters'!$C$49)","v":0},{"$f":"-'User Parameters'!$C$12*('User Parameters'!$C$13-1)","v":0},-0.22800431793791467]
[1.1450039253981039,454.54342697283204,520.45400814779907,1.1450039253981039,{"$f":"'User Parameters'!$C$10","v":40},{"$f":"B141*'User Parameters'!$C$14","v":0},-105.91058117496704,-0.23300431793791462,1.1450039253981039,{"$f":"IF(UP_RSBasis=\"MLR\",UP_RSTarget_MLR,IF(UP_RSBasis=\"Medical Baseline\",UP_RSTarget_Medlcal,0))","v":0},0,0,0,0,0,0,0,"",0,{"$f":"(S141+C141+'User Parameters'!$C$11)/(B141-F141)","v":1.1450039253981039},{"$f":"IF(T141<'User Parameters'!$J$5,'User Parameters'!$J$5,IF(T141>'User Parameters'!$J$6,'User Parameters'!$J$6,T141))","v":1.1450039253981039},0,0,{"$f":"(B141-C141-F141-E141-S141-V141)/'Results Dashboard'!$D$42","v":-0.23300431793791462},{"$f":"IF((X141+W141)>0,(X141+W141)*0.5*((1+'User Parameters'!C$48)^((12+UP_COC_WithholdLag)/12)-1),(X141+W141)*0.5*((1+'User Parameters'!$C$49)^((12+UP_COC_WithholdLag)/12)-1))","v":0},{"$f":"-'User Parameters'!$C$12*('User Parameters'!$C$13-1)","v":0},-0.23300431793791462,4.3222566744846294E-16,1.0436445787897885E-15,1.0436445787897885E-15,{"$f":"IF($AA141<-'Results Dashboard'!$J$7,$AA141+'Results Dashboard'!$J$7,0)","v":-0.19797464362513492},{"$f":"IF($AA141<-'Results Dashboard'!$J$8,$AA141+'Results Dashboard'!$J$8,0)","v":-0.16294496931235525},{"$f":"IF($AA141<-'Results Dashboard'!$J$9,$AA141+'Results Dashboard'!$J$9,0)","v":-0.16294496931235525},{"$f":"IF($AA141<-'Results Dashboard'!$J$11,$AA141+'Results Dashboard'!$J$11,0)","v":-7.5370783530405994E-2},{"$f":"IF($AA141<-'Results Dashboard'!$J$10,$AA141+'Results Dashboard'!$J$10,0)","v":-7.5370783530405994E-2},null,{"$f":"IF((X141+W141)>0,(X141+W141)*0.5*'User Parameters'!C$48,(X141+W141)*0.5*'User Parameters'!$C$49)","v":0},{"$f":"-'User Parameters'!$C$12*('User Parameters'!$C$13-1)","v":0},-0.23300431793791462]
[1.1500039253981038,454.54342697283204,522.72672528266321,1.1500039253981038,{"$f":"'User Parameters'!$C$10","v":40},{"$f":"B142*'User Parameters'!$C$14","v":0},-108.18329830983117,-0.23800431793791457,1.1500039253981038,{"$f":"IF(UP_RSBasis=\"MLR\",UP_RSTarget_MLR,IF(UP_RSBasis=\"Medical Baseline\",UP_RSTarget_Medlcal,0))","v":0},0,0,0,0,0,0,0,"",0,{"$f":"(S142+C142+'User Parameters'!$C$11)/(B142-F142)","v":1.1500039253981038},{"$f":"IF(T142<'User Parameters'!$J$5,'User Parameters'!$J$5,IF(T142>'User Parameters'!$J$6,'User Parameters'!$J$6,T142))","v":1.1500039253981038},0,0,{"$f":"(B142-C142-F142-E142-S142-V142)/'Results Dashboard'!$D$42","v":-0.23800431793791457},{"$f":"IF((X142+W142)>0,(X142+W142)*0.5*((1+'User Parameters'!C$48)^((12+UP_COC_WithholdLag)/12)-1),(X142+W142)*0.5*((1+'User Parameters'!$C$49)^((12+UP_COC_WithholdLag)/12)-1))","v":0},{"$f":"-'User Parameters'!$C$12*('User Parameters'!$C$13-1)","v":0},-0.23800431793791457,1.2373967447249303E-16,3.0848599297596992E-16,3.0848599297596992E-16,{"$f":"IF($AA142<-'Results Dashboard'!$J$7,$AA142+'Results Dashboard'!$J$7,0)","v":-0.20297464362513487},{"$f":"IF($AA142<-'Results Dashboard'!$J$8,$AA142+'Results Dashboard'!$J$8,0)","v":-0.1679449693123552},{"$f":"IF($AA142<-'Results Dashboard'!$J$9,$AA142+'Results Dashboard'!$J$9,0)","v":-0.1679449693123552},{"$f":"IF($AA142<-'Results Dashboard'!$J$11,$AA142+'Results Dashboard'!$J$11,0)","v":-8.0370783530405943E-2},{"$f":"IF($AA142<-'Results Dashboard'!$J$10,$AA142+'Results Dashboard'!$J$10,0)","v":-8.0370783530405943E-2},null,{"$f":"IF((X142+W142)>0,(X142+W142)*0.5*'User Parameters'!C$48,(X142+W142)*0.5*'User Parameters'!$C$49)","v":0},{"$f":"-'User Parameters'!$C$12*('User Parameters'!$C$13-1)","v":0},-0.23800431793791457]
[1.1550039253981037,454.54342697283204,524.99944241752735,1.1550039253981039,{"$f":"'User Parameters'!$C$10","v":40},{"$f":"B143*'User Parameters'!$C$14","v":0},-110.45601544469531,-0.24300431793791452,1.1550039253981039,{"$f":"IF(UP_RSBasis=\"MLR\",UP_RSTarget_MLR,IF(UP_RSBasis=\"Medical Baseline\",UP_RSTarget_Medlcal,0))","v":0},0,0,0,0,0,0,0,"",0,{"$f":"(S143+C143+'User Parameters'!$C$11)/(B143-F143)","v":1.1550039253981039},{"$f":"IF(T143<'User Parameters'!$J$5,'User Parameters'!$J$5,IF(T143>'User Parameters'!$J$6,'User Parameters'!$J$6,T143))","v":1.1550039253981039},0,0,{"$f":"(B143-C143-F143-E143-S143-V143)/'Results Dashboard'!$D$42","v":-0.24300431793791452},{"$f":"IF((X143+W143)>0,(X143+W143)*0.5*((1+'User Parameters'!C$48)^((12+UP_COC_WithholdLag)/12)-1),(X143+W143)*0.5*((1+'User Parameters'!$C$49)^((12+UP_COC_WithholdLag)/12)-1))","v":0},{"$f":"-'User Parameters'!$C$12*('User Parameters'!$C$13-1)","v":0},-0.24300431793791452,3.4628893900782458E-17,8.9110780571710562E-17,8.9110780571710562E-17,{"$f":"IF($AA143<-'Results Dashboard'!$J$7,$AA143+'Results Dashboard'!$J$7,0)","v":-0.20797464362513482},{"$f":"IF($AA143<-'Results Dashboard'!$J$8,$AA143+'Results Dashboard'!$J$8,0)","v":-0.17294496931235515},{"$f":"IF($AA143<-'Results Dashboard'!$J$9,$AA143+'Results Dashboard'!$J$9,0)","v":-0.17294496931235515},{"$f":"IF($AA143<-'Results Dashboard'!$J$11,$AA143+'Results Dashboard'!$J$11,0)","v":-8.5370783530405892E-2},{"$f":"IF($AA143<-'Results Dashboard'!$J$10,$AA143+'Results Dashboard'!$J$10,0)","v":-8.5370783530405892E-2},null,{"$f":"IF((X143+W143)>0,(X143+W143)*0.5*'User Parameters'!C$48,(X143+W143)*0.5*'User Parameters'!$C$49)","v":0},{"$f":"-'User Parameters'!$C$12*('User Parameters'!$C$13-1)","v":0},-0.24300431793791452]
[1.1600039253981036,454.54342697283204,527.27215955239137,1.1600039253981036,{"$f":"'User Parameters'!$C$10","v":40},{"$f":"B144*'User Parameters'!$C$14","v":0},-112.72873257955933,-0.24800431793791422,1.1600039253981036,{"$f":"IF(UP_RSBasis=\"MLR\",UP_RSTarget_MLR,IF(UP_RSBasis=\"Medical Baseline\",UP_RSTarget_Medlcal,0))","v":0},0,0,0,0,0,0,0,"",0,{"$f":"(S144+C144+'User Parameters'!$C$11)/(B144-F144)","v":1.1600039253981036},{"$f":"IF(T144<'User Parameters'!$J$5,'User Parameters'!$J$5,IF(T144>'User Parameters'!$J$6,'User Parameters'!$J$6,T144))","v":1.1600039253981036},0,0,{"$f":"(B144-C144-F144-E144-S144-V144)/'Results Dashboard'!$D$42","v":-0.24800431793791422},{"$f":"IF((X144+W144)>0,(X144+W144)*0.5*((1+'User Parameters'!C$48)^((12+UP_COC_WithholdLag)/12)-1),(X144+W144)*0.5*((1+'User Parameters'!$C$49)^((12+UP_COC_WithholdLag)/12)-1))","v":0},{"$f":"-'User Parameters'!$C$12*('User Parameters'!$C$13-1)","v":0},-0.24800431793791422,9.4731613698242589E-18,2.5155732530958199E-17,2.5155732530958199E-17,{"$f":"IF($AA144<-'Results Dashboard'!$J$7,$AA144+'Results Dashboard'!$J$7,0)","v":-0.21297464362513452},{"$f":"IF($AA144<-'Results Dashboard'!$J$8,$AA144+'Results Dashboard'!$J$8,0)","v":-0.17794496931235482},{"$f":"IF($AA144<-'Results Dashboard'!$J$9,$AA144+'Results Dashboard'!$J$9,0)","v":-0.17794496931235482},{"$f":"IF($AA144<-'Results Dashboard'!$J$11,$AA144+'Results Dashboard'!$J$11,0)","v":-9.0370783530405591E-2},{"$f":"IF($AA144<-'Results Dashboard'!$J$10,$AA144+'Results Dashboard'!$J$10,0)","v":-9.0370783530405591E-2},null,{"$f":"IF((X144+W144)>0,(X144+W144)*0.5*'User Parameters'!C$48,(X144+W144)*0.5*'User Parameters'!$C$49)","v":0},{"$f":"-'User Parameters'!$C$12*('User Parameters'!$C$13-1)","v":0},-0.24800431793791422]
[1.1650039253981035,454.54342697283204,529.54487668725551,1.1650039253981035,{"$f":"'User Parameters'!$C$10","v":40},{"$f":"B145*'User Parameters'!$C$14","v":0},-115.00144971442347,-0.25300431793791417,1.1650039253981035,{"$f":"IF(UP_RSBasis=\"MLR\",UP_RSTarget_MLR,IF(UP_RSBasis=\"Medical Baseline\",UP_RSTarget_Medlcal,0))","v":0},0,0,0,0,0,0,0,"",0,{"$f":"(S145+C145+'User Parameters'!$C$11)/(B145-F145)","v":1.1650039253981035},{"$f":"IF(T145<'User Parameters'!$J$5,'User Parameters'!$J$5,IF(T145>'User Parameters'!$J$6,'User Parameters'!$J$6,T145))","v":1.1650039253981035},0,0,{"$f":"(B145-C145-F145-E145-S145-V145)/'Results Dashboard'!$D$42","v":-0.25300431793791417},{"$f":"IF((X145+W145)>0,(X145+W145)*0.5*((1+'User Parameters'!C$48)^((12+UP_COC_WithholdLag)/12)-1),(X145+W145)*0.5*((1+'User Parameters'!$C$49)^((12+UP_COC_WithholdLag)/12)-1))","v":0},{"$f":"-'User Parameters'!$C$12*('User Parameters'!$C$13-1)","v":0},-0.25300431793791417,2.5332238340436166E-18,6.9399375357806419E-18,6.9399375357806419E-18,{"$f":"IF($AA145<-'Results Dashboard'!$J$7,$AA145+'Results Dashboard'!$J$7,0)","v":-0.21797464362513447},{"$f":"IF($AA145<-'Results Dashboard'!$J$8,$AA145+'Results Dashboard'!$J$8,0)","v":-0.18294496931235477},{"$f":"IF($AA145<-'Results Dashboard'!$J$9,$AA145+'Results Dashboard'!$J$9,0)","v":-0.18294496931235477},{"$f":"IF($AA145<-'Results Dashboard'!$J$11,$AA145+'Results Dashboard'!$J$11,0)","v":-9.537078353040554E-2},{"$f":"IF($AA145<-'Results Dashboard'!$J$10,$AA145+'Results Dashboard'!$J$10,0)","v":-9.537078353040554E-2},null,{"$f":"IF((X145+W145)>0,(X145+W145)*0.5*'User Parameters'!C$48,(X145+W145)*0.5*'User Parameters'!$C$49)","v":0},{"$f":"-'User Parameters'!$C$12*('User Parameters'!$C$13-1)","v":0},-0.25300431793791417]
[1.1700039253981034,454.54342697283204,531.81759382211965,1.1700039253981034,{"$f":"'User Parameters'!$C$10","v":40},{"$f":"B146*'User Parameters'!$C$14","v":0},-117.27416684928761,-0.25800431793791412,1.1700039253981034,{"$f":"IF(UP_RSBasis=\"MLR\",UP_RSTarget_MLR,IF(UP_RSBasis=\"Medical Baseline\",UP_RSTarget_Medlcal,0))","v":0},0,0,0,0,0,0,0,"",0,{"$f":"(S146+C146+'User Parameters'!$C$11)/(B146-F146)","v":1.1700039253981034},{"$f":"IF(T146<'User Parameters'!$J$5,'User Parameters'!$J$5,IF(T146>'User Parameters'!$J$6,'User Parameters'!$J$6,T146))","v":1.1700039253981034},0,0,{"$f":"(B146-C146-F146-E146-S146-V146)/'Results Dashboard'!$D$42","v":-0.25800431793791412},{"$f":"IF((X146+W146)>0,(X146+W146)*0.5*((1+'User Parameters'!C$48)^((12+UP_COC_WithholdLag)/12)-1),(X146+W146)*0.5*((1+'User Parameters'!$C$49)^((12+UP_COC_WithholdLag)/12)-1))","v":0},{"$f":"-'User Parameters'!$C$12*('User Parameters'!$C$13-1)","v":0},-0.25800431793791412,6.6217131878097184E-19,1.8710525152626448E-18,1.8710525152626448E-18,{"$f":"IF($AA146<-'Results Dashboard'!$J$7,$AA146+'Results Dashboard'!$J$7,0)","v":-0.22297464362513442},{"$f":"IF($AA146<-'Results Dashboard'!$J$8,$AA146+'Results Dashboard'!$J$8,0)","v":-0.18794496931235471},{"$f":"IF($AA146<-'Results Dashboard'!$J$9,$AA146+'Results Dashboard'!$J$9,0)","v":-0.18794496931235471},{"$f":"IF($AA146<-'Results Dashboard'!$J$11,$AA146+'Results Dashboard'!$J$11,0)","v":-0.10037078353040549},{"$f":"IF($AA146<-'Results Dashboard'!$J$10,$AA146+'Results Dashboard'!$J$10,0)","v":-0.10037078353040549},null,{"$f":"IF((X146+W146)>0,(X146+W146)*0.5*'User Parameters'!C$48,(X146+W146)*0.5*'User Parameters'!$C$49)","v":0},{"$f":"-'User Parameters'!$C$12*('User Parameters'!$C$13-1)","v":0},-0.25800431793791412]
[1.1750039253981033,454.54342697283204,534.09031095698379,1.1750039253981033,{"$f":"'User Parameters'!$C$10","v":40},{"$f":"B147*'User Parameters'!$C$14","v":0},-119.54688398415175,-0.26300431793791407,1.1750039253981033,{"$f":"IF(UP_RSBasis=\"MLR\",UP_RSTarget_MLR,IF(UP_RSBasis=\"Medical Baseline\",UP_RSTarget_Medlcal,0))","v":0},0,0,0,0,0,0,0,"",0,{"$f":"(S147+C147+'User Parameters'!$C$11)/(B147-F147)","v":1.1750039253981033},{"$f":"IF(T147<'User Parameters'!$J$5,'User Parameters'!$J$5,IF(T147>'User Parameters'!$J$6,'User Parameters'!$J$6,T147))","v":1.1750039253981033},0,0,{"$f":"(B147-C147-F147-E147-S147-V147)/'Results Dashboard'!$D$42","v":-0.26300431793791407},{"$f":"IF((X147+W147)>0,(X147+W147)*0.5*((1+'User Parameters'!C$48)^((12+UP_COC_WithholdLag)/12)-1),(X147+W147)*0.5*((1+'User Parameters'!$C$49)^((12+UP_COC_WithholdLag)/12)-1))","v":0},{"$f":"-'User Parameters'!$C$12*('User Parameters'!$C$13-1)","v":0},-0.26300431793791407,1.6919260829534876E-19,4.9297871048562308E-19,4.9297871048562308E-19,{"$f":"IF($AA147<-'Results Dashboard'!$J$7,$AA147+'Results Dashboard'!$J$7,0)","v":-0.22797464362513437},{"$f":"IF($AA147<-'Results Dashboard'!$J$8,$AA147+'Results Dashboard'!$J$8,0)","v":-0.19294496931235466},{"$f":"IF($AA147<-'Results Dashboard'!$J$9,$AA147+'Results Dashboard'!$J$9,0)","v":-0.19294496931235466},{"$f":"IF($AA147<-'Results Dashboard'!$J$11,$AA147+'Results Dashboard'!$J$11,0)","v":-0.10537078353040544},{"$f":"IF($AA147<-'Results Dashboard'!$J$10,$AA147+'Results Dashboard'!$J$10,0)","v":-0.10537078353040544},null,{"$f":"IF((X147+W147)>0,(X147+W147)*0.5*'User Parameters'!C$48,(X147+W147)*0.5*'User Parameters'!$C$49)","v":0},{"$f":"-'User Parameters'!$C$12*('User Parameters'!$C$13-1)","v":0},-0.26300431793791407]
[1.1800039253981032,454.54342697283204,536.36302809184781,1.1800039253981032,{"$f":"'User Parameters'!$C$10","v":40},{"$f":"B148*'User Parameters'!$C$14","v":0},-121.81960111901577,-0.26800431793791379,1.1800039253981032,{"$f":"IF(UP_RSBasis=\"MLR\",UP_RSTarget_MLR,IF(UP_RSBasis=\"Medical Baseline\",UP_RSTarget_Medlcal,0))","v":0},0,0,0,0,0,0,0,"",0,{"$f":"(S148+C148+'User Parameters'!$C$11)/(B148-F148)","v":1.1800039253981032},{"$f":"IF(T148<'User Parameters'!$J$5,'User Parameters'!$J$5,IF(T148>'User Parameters'!$J$6,'User Parameters'!$J$6,T148))","v":1.1800039253981032},0,0,{"$f":"(B148-C148-F148-E148-S148-V148)/'Results Dashboard'!$D$42","v":-0.26800431793791379},{"$f":"IF((X148+W148)>0,(X148+W148)*0.5*((1+'User Parameters'!C$48)^((12+UP_COC_WithholdLag)/12)-1),(X148+W148)*0.5*((1+'User Parameters'!$C$49)^((12+UP_COC_WithholdLag)/12)-1))","v":0},{"$f":"-'User Parameters'!$C$12*('User Parameters'!$C$13-1)","v":0},-0.26800431793791379,4.2257408124459113E-20,1.2693520017088966E-19,1.2693520017088966E-19,{"$f":"IF($AA148<-'Results Dashboard'!$J$7,$AA148+'Results Dashboard'!$J$7,0)","v":-0.23297464362513409},{"$f":"IF($AA148<-'Results Dashboard'!$J$8,$AA148+'Results Dashboard'!$J$8,0)","v":-0.19794496931235439},{"$f":"IF($AA148<-'Results Dashboard'!$J$9,$AA148+'Results Dashboard'!$J$9,0)","v":-0.19794496931235439},{"$f":"IF($AA148<-'Results Dashboard'!$J$11,$AA148+'Results Dashboard'!$J$11,0)","v":-0.11037078353040516},{"$f":"IF($AA148<-'Results Dashboard'!$J$10,$AA148+'Results Dashboard'!$J$10,0)","v":-0.11037078353040516},null,{"$f":"IF((X148+W148)>0,(X148+W148)*0.5*'User Parameters'!C$48,(X148+W148)*0.5*'User Parameters'!$C$49)","v":0},{"$f":"-'User Parameters'!$C$12*('User Parameters'!$C$13-1)","v":0},-0.26800431793791379]
[1.1850039253981031,454.54342697283204,538.63574522671195,1.1850039253981031,{"$f":"'User Parameters'!$C$10","v":40},{"$f":"B149*'User Parameters'!$C$14","v":0},-124.09231825387991,-0.27300431793791374,1.1850039253981031,{"$f":"IF(UP_RSBasis=\"MLR\",UP_RSTarget_MLR,IF(UP_RSBasis=\"Medical Baseline\",UP_RSTarget_Medlcal,0))","v":0},0,0,0,0,0,0,0,"",0,{"$f":"(S149+C149+'User Parameters'!$C$11)/(B149-F149)","v":1.1850039253981031},{"$f":"IF(T149<'User Parameters'!$J$5,'User Parameters'!$J$5,IF(T149>'User Parameters'!$J$6,'User Parameters'!$J$6,T149))","v":1.1850039253981031},0,0,{"$f":"(B149-C149-F149-E149-S149-V149)/'Results Dashboard'!$D$42","v":-0.27300431793791374},{"$f":"IF((X149+W149)>0,(X149+W149)*0.5*((1+'User Parameters'!C$48)^((12+UP_COC_WithholdLag)/12)-1),(X149+W149)*0.5*((1+'User Parameters'!$C$49)^((12+UP_COC_WithholdLag)/12)-1))","v":0},{"$f":"-'User Parameters'!$C$12*('User Parameters'!$C$13-1)","v":0},-0.27300431793791374,1.0316471409786912E-20,3.1940936714672203E-20,3.1940936714672203E-20,{"$f":"IF($AA149<-'Results Dashboard'!$J$7,$AA149+'Results Dashboard'!$J$7,0)","v":-0.23797464362513404},{"$f":"IF($AA149<-'Results Dashboard'!$J$8,$AA149+'Results Dashboard'!$J$8,0)","v":-0.20294496931235434},{"$f":"IF($AA149<-'Results Dashboard'!$J$9,$AA149+'Results Dashboard'!$J$9,0)","v":-0.20294496931235434},{"$f":"IF($AA149<-'Results Dashboard'!$J$11,$AA149+'Results Dashboard'!$J$11,0)","v":-0.11537078353040511},{"$f":"IF($AA149<-'Results Dashboard'!$J$10,$AA149+'Results Dashboard'!$J$10,0)","v":-0.11537078353040511},null,{"$f":"IF((X149+W149)>0,(X149+W149)*0.5*'User Parameters'!C$48,(X149+W149)*0.5*'User Parameters'!$C$49)","v":0},{"$f":"-'User Parameters'!$C$12*('User Parameters'!$C$13-1)","v":0},-0.27300431793791374]
[1.190003925398103,454.54342697283204,540.90846236157608,1.190003925398103,{"$f":"'User Parameters'!$C$10","v":40},{"$f":"B150*'User Parameters'!$C$14","v":0},-126.36503538874405,-0.27800431793791369,1.190003925398103,{"$f":"IF(UP_RSBasis=\"MLR\",UP_RSTarget_MLR,IF(UP_RSBasis=\"Medical Baseline\",UP_RSTarget_Medlcal,0))","v":0},0,0,0,0,0,0,0,"",0,{"$f":"(S150+C150+'User Parameters'!$C$11)/(B150-F150)","v":1.190003925398103},{"$f":"IF(T150<'User Parameters'!$J$5,'User Parameters'!$J$5,IF(T150>'User Parameters'!$J$6,'User Parameters'!$J$6,T150))","v":1.190003925398103},0,0,{"$f":"(B150-C150-F150-E150-S150-V150)/'Results Dashboard'!$D$42","v":-0.27800431793791369},{"$f":"IF((X150+W150)>0,(X150+W150)*0.5*((1+'User Parameters'!C$48)^((12+UP_COC_WithholdLag)/12)-1),(X150+W150)*0.5*((1+'User Parameters'!$C$49)^((12+UP_COC_WithholdLag)/12)-1))","v":0},{"$f":"-'User Parameters'!$C$12*('User Parameters'!$C$13-1)","v":0},-0.27800431793791369,2.4618575404190185E-21,7.8546138693678934E-21,7.8546138693678934E-21,{"$f":"IF($AA150<-'Results Dashboard'!$J$7,$AA150+'Results Dashboard'!$J$7,0)","v":-0.24297464362513399},{"$f":"IF($AA150<-'Results Dashboard'!$J$8,$AA150+'Results Dashboard'!$J$8,0)","v":-0.20794496931235429},{"$f":"IF($AA150<-'Results Dashboard'!$J$9,$AA150+'Results Dashboard'!$J$9,0)","v":-0.20794496931235429},{"$f":"IF($AA150<-'Results Dashboard'!$J$11,$AA150+'Results Dashboard'!$J$11,0)","v":-0.12037078353040506},{"$f":"IF($AA150<-'Results Dashboard'!$J$10,$AA150+'Results Dashboard'!$J$10,0)","v":-0.12037078353040506},null,{"$f":"IF((X150+W150)>0,(X150+W150)*0.5*'User Parameters'!C$48,(X150+W150)*0.5*'User Parameters'!$C$49)","v":0},{"$f":"-'User Parameters'!$C$12*('User Parameters'!$C$13-1)","v":0},-0.27800431793791369]
[1.1950039253981029,454.54342697283204,543.18117949644022,1.1950039253981029,{"$f":"'User Parameters'!$C$10","v":40},{"$f":"B151*'User Parameters'!$C$14","v":0},-128.63775252360819,-0.28300431793791364,1.1950039253981029,{"$f":"IF(UP_RSBasis=\"MLR\",UP_RSTarget_MLR,IF(UP_RSBasis=\"Medical Baseline\",UP_RSTarget_Medlcal,0))","v":0},0,0,0,0,0,0,0,"",0,{"$f":"(S151+C151+'User Parameters'!$C$11)/(B151-F151)","v":1.1950039253981029},{"$f":"IF(T151<'User Parameters'!$J$5,'User Parameters'!$J$5,IF(T151>'User Parameters'!$J$6,'User Parameters'!$J$6,T151))","v":1.1950039253981029},0,0,{"$f":"(B151-C151-F151-E151-S151-V151)/'Results Dashboard'!$D$42","v":-0.28300431793791364},{"$f":"IF((X151+W151)>0,(X151+W151)*0.5*((1+'User Parameters'!C$48)^((12+UP_COC_WithholdLag)/12)-1),(X151+W151)*0.5*((1+'User Parameters'!$C$49)^((12+UP_COC_WithholdLag)/12)-1))","v":0},{"$f":"-'User Parameters'!$C$12*('User Parameters'!$C$13-1)","v":0},-0.28300431793791364,5.7424178196021058E-22,1.8876157584588078E-21,1.8876157584588078E-21,{"$f":"IF($AA151<-'Results Dashboard'!$J$7,$AA151+'Results Dashboard'!$J$7,0)","v":-0.24797464362513394},{"$f":"IF($AA151<-'Results Dashboard'!$J$8,$AA151+'Results Dashboard'!$J$8,0)","v":-0.21294496931235424},{"$f":"IF($AA151<-'Results Dashboard'!$J$9,$AA151+'Results Dashboard'!$J$9,0)","v":-0.21294496931235424},{"$f":"IF($AA151<-'Results Dashboard'!$J$11,$AA151+'Results Dashboard'!$J$11,0)","v":-0.12537078353040501},{"$f":"IF($AA151<-'Results Dashboard'!$J$10,$AA151+'Results Dashboard'!$J$10,0)","v":-0.12537078353040501},null,{"$f":"IF((X151+W151)>0,(X151+W151)*0.5*'User Parameters'!C$48,(X151+W151)*0.5*'User Parameters'!$C$49)","v":0},{"$f":"-'User Parameters'!$C$12*('User Parameters'!$C$13-1)","v":0},-0.28300431793791364]
[1.2000039253981027,454.54342697283204,545.45389663130425,1.2000039253981025,{"$f":"'User Parameters'!$C$10","v":40},{"$f":"B152*'User Parameters'!$C$14","v":0},-130.91046965847221,-0.28800431793791331,1.2000039253981025,{"$f":"IF(UP_RSBasis=\"MLR\",UP_RSTarget_MLR,IF(UP_RSBasis=\"Medical Baseline\",UP_RSTarget_Medlcal,0))","v":0},0,0,0,0,0,0,0,"",0,{"$f":"(S152+C152+'User Parameters'!$C$11)/(B152-F152)","v":1.2000039253981025},{"$f":"IF(T152<'User Parameters'!$J$5,'User Parameters'!$J$5,IF(T152>'User Parameters'!$J$6,'User Parameters'!$J$6,T152))","v":1.2000039253981025},0,0,{"$f":"(B152-C152-F152-E152-S152-V152)/'Results Dashboard'!$D$42","v":-0.28800431793791331},{"$f":"IF((X152+W152)>0,(X152+W152)*0.5*((1+'User Parameters'!C$48)^((12+UP_COC_WithholdLag)/12)-1),(X152+W152)*0.5*((1+'User Parameters'!$C$49)^((12+UP_COC_WithholdLag)/12)-1))","v":0},{"$f":"-'User Parameters'!$C$12*('User Parameters'!$C$13-1)","v":0},-0.28800431793791331,1.3092532148454391E-22,4.4331646047566665E-22,4.4331646047566665E-22,{"$f":"IF($AA152<-'Results Dashboard'!$J$7,$AA152+'Results Dashboard'!$J$7,0)","v":-0.25297464362513361},{"$f":"IF($AA152<-'Results Dashboard'!$J$8,$AA152+'Results Dashboard'!$J$8,0)","v":-0.21794496931235391},{"$f":"IF($AA152<-'Results Dashboard'!$J$9,$AA152+'Results Dashboard'!$J$9,0)","v":-0.21794496931235391},{"$f":"IF($AA152<-'Results Dashboard'!$J$11,$AA152+'Results Dashboard'!$J$11,0)","v":-0.13037078353040468},{"$f":"IF($AA152<-'Results Dashboard'!$J$10,$AA152+'Results Dashboard'!$J$10,0)","v":-0.13037078353040468},null,{"$f":"IF((X152+W152)>0,(X152+W152)*0.5*'User Parameters'!C$48,(X152+W152)*0.5*'User Parameters'!$C$49)","v":0},{"$f":"-'User Parameters'!$C$12*('User Parameters'!$C$13-1)","v":0},-0.28800431793791331]
[1.2050039253981026,{"$f":"$B$88","v":454.54342697283204},547.72661376616838,1.2050039253981026,{"$f":"'User Parameters'!$C$10","v":40},{"$f":"B153*'User Parameters'!$C$14","v":0},-133.18318679333635,-0.29300431793791326,1.2050039253981026,{"$f":"IF(UP_RSBasis=\"MLR\",UP_RSTarget_MLR,IF(UP_RSBasis=\"Medical Baseline\",UP_RSTarget_Medlcal,0))","v":0},0,0,0,0,0,0,0,"",0,{"$f":"(S153+C153+'User Parameters'!$C$11)/(B153-F153)","v":1.2050039253981026},{"$f":"IF(T153<'User Parameters'!$J$5,'User Parameters'!$J$5,IF(T153>'User Parameters'!$J$6,'User Parameters'!$J$6,T153))","v":1.2050039253981026},0,0,{"$f":"(B153-C153-F153-E153-S153-V153)/'Results Dashboard'!$D$42","v":-0.29300431793791326},{"$f":"IF((X153+W153)>0,(X153+W153)*0.5*((1+'User Parameters'!C$48)^((12+UP_COC_WithholdLag)/12)-1),(X153+W153)*0.5*((1+'User Parameters'!$C$49)^((12+UP_COC_WithholdLag)/12)-1))","v":0},{"$f":"-'User Parameters'!$C$12*('User Parameters'!$C$13-1)","v":0},-0.29300431793791326,2.9177393503739221E-23,1.0174792798080469E-22,1.0174792798080469E-22,{"$f":"IF($AA153<-'Results Dashboard'!$J$7,$AA153+'Results Dashboard'!$J$7,0)","v":-0.25797464362513356},{"$f":"IF($AA153<-'Results Dashboard'!$J$8,$AA153+'Results Dashboard'!$J$8,0)","v":-0.22294496931235386},{"$f":"IF($AA153<-'Results Dashboard'!$J$9,$AA153+'Results Dashboard'!$J$9,0)","v":-0.22294496931235386},{"$f":"IF($AA153<-'Results Dashboard'!$J$11,$AA153+'Results Dashboard'!$J$11,0)","v":-0.13537078353040463},{"$f":"IF($AA153<-'Results Dashboard'!$J$10,$AA153+'Results Dashboard'!$J$10,0)","v":-0.13537078353040463},null,{"$f":"IF((X153+W153)>0,(X153+W153)*0.5*'User Parameters'!C$48,(X153+W153)*0.5*'User Parameters'!$C$49)","v":0},{"$f":"-'User Parameters'!$C$12*('User Parameters'!$C$13-1)","v":0},-0.29300431793791326]
[1.2100039253981025,454.54342697283204,549.99933090103252,1.2100039253981025,{"$f":"'User Parameters'!$C$10","v":40},{"$f":"B154*'User Parameters'!$C$14","v":0},-135.45590392820048,-0.29800431793791321,1.2100039253981025,{"$f":"IF(UP_RSBasis=\"MLR\",UP_RSTarget_MLR,IF(UP_RSBasis=\"Medical Baseline\",UP_RSTarget_Medlcal,0))","v":0},0,0,0,0,0,0,0,"",0,{"$f":"(S154+C154+'User Parameters'!$C$11)/(B154-F154)","v":1.2100039253981025},{"$f":"IF(T154<'User Parameters'!$J$5,'User Parameters'!$J$5,IF(T154>'User Parameters'!$J$6,'User Parameters'!$J$6,T154))","v":1.2100039253981025},0,0,{"$f":"(B154-C154-F154-E154-S154-V154)/'Results Dashboard'!$D$42","v":-0.29800431793791321},{"$f":"IF((X154+W154)>0,(X154+W154)*0.5*((1+'User Parameters'!C$48)^((12+UP_COC_WithholdLag)/12)-1),(X154+W154)*0.5*((1+'User Parameters'!$C$49)^((12+UP_COC_WithholdLag)/12)-1))","v":0},{"$f":"-'User Parameters'!$C$12*('User Parameters'!$C$13-1)","v":0},-0.29800431793791321,6.3556568439393136E-24,{"$f":"AB153-AB154","v":2.2821736659799908E-23},2.2821736659799908E-23,{"$f":"IF($AA154<-'Results Dashboard'!$J$7,$AA154+'Results Dashboard'!$J$7,0)","v":-0.26297464362513351},{"$f":"IF($AA154<-'Results Dashboard'!$J$8,$AA154+'Results Dashboard'!$J$8,0)","v":-0.22794496931235381},{"$f":"IF($AA154<-'Results Dashboard'!$J$9,$AA154+'Results Dashboard'!$J$9,0)","v":-0.22794496931235381},{"$f":"IF($AA154<-'Results Dashboard'!$J$11,$AA154+'Results Dashboard'!$J$11,0)","v":-0.14037078353040458},{"$f":"IF($AA154<-'Results Dashboard'!$J$10,$AA154+'Results Dashboard'!$J$10,0)","v":-0.14037078353040458},null,{"$f":"IF((X154+W154)>0,(X154+W154)*0.5*'User Parameters'!C$48,(X154+W154)*0.5*'User Parameters'!$C$49)","v":0},{"$f":"-'User Parameters'!$C$12*('User Parameters'!$C$13-1)","v":0},-0.29800431793791321]
[1.2150039253981024,454.54342697283204,552.27204803589666,1.2150039253981024,{"$f":"'User Parameters'!$C$10","v":40},{"$f":"B155*'User Parameters'!$C$14","v":0},-137.72862106306462,-0.30300431793791316,1.2150039253981024,{"$f":"IF(UP_RSBasis=\"MLR\",UP_RSTarget_MLR,IF(UP_RSBasis=\"Medical Baseline\",UP_RSTarget_Medlcal,0))","v":0},0,0,0,0,0,0,0,"",0,{"$f":"(S155+C155+'User Parameters'!$C$11)/(B155-F155)","v":1.2150039253981024},{"$f":"IF(T155<'User Parameters'!$J$5,'User Parameters'!$J$5,IF(T155>'User Parameters'!$J$6,'User Parameters'!$J$6,T155))","v":1.2150039253981024},0,0,{"$f":"(B155-C155-F155-E155-S155-V155)/'Results Dashboard'!$D$42","v":-0.30300431793791316},{"$f":"IF((X155+W155)>0,(X155+W155)*0.5*((1+'User Parameters'!C$48)^((12+UP_COC_WithholdLag)/12)-1),(X155+W155)*0.5*((1+'User Parameters'!$C$49)^((12+UP_COC_WithholdLag)/12)-1))","v":0},{"$f":"-'User Parameters'!$C$12*('User Parameters'!$C$13-1)","v":0},-0.30300431793791316,1.3532023239506315E-24,5.0024545199886819E-24,5.0024545199886819E-24,{"$f":"IF($AA155<-'Results Dashboard'!$J$7,$AA155+'Results Dashboard'!$J$7,0)","v":-0.26797464362513346},{"$f":"IF($AA155<-'Results Dashboard'!$J$8,$AA155+'Results Dashboard'!$J$8,0)","v":-0.23294496931235376},{"$f":"IF($AA155<-'Results Dashboard'!$J$9,$AA155+'Results Dashboard'!$J$9,0)","v":-0.23294496931235376},{"$f":"IF($AA155<-'Results Dashboard'!$J$11,$AA155+'Results Dashboard'!$J$11,0)","v":-0.14537078353040453},{"$f":"IF($AA155<-'Results Dashboard'!$J$10,$AA155+'Results Dashboard'!$J$10,0)","v":-0.14537078353040453},null,{"$f":"IF((X155+W155)>0,(X155+W155)*0.5*'User Parameters'!C$48,(X155+W155)*0.5*'User Parameters'!$C$49)","v":0},{"$f":"-'User Parameters'!$C$12*('User Parameters'!$C$13-1)","v":0},-0.30300431793791316]
[1.2200039253981023,454.54342697283204,554.5447651707608,1.2200039253981025,{"$f":"'User Parameters'!$C$10","v":40},{"$f":"B156*'User Parameters'!$C$14","v":0},-140.00133819792876,-0.30800431793791311,1.2200039253981025,{"$f":"IF(UP_RSBasis=\"MLR\",UP_RSTarget_MLR,IF(UP_RSBasis=\"Medical Baseline\",UP_RSTarget_Medlcal,0))","v":0},0,0,0,0,0,0,0,"",0,{"$f":"(S156+C156+'User Parameters'!$C$11)/(B156-F156)","v":1.2200039253981025},{"$f":"IF(T156<'User Parameters'!$J$5,'User Parameters'!$J$5,IF(T156>'User Parameters'!$J$6,'User Parameters'!$J$6,T156))","v":1.2200039253981025},0,0,{"$f":"(B156-C156-F156-E156-S156-V156)/'Results Dashboard'!$D$42","v":-0.30800431793791311},{"$f":"IF((X156+W156)>0,(X156+W156)*0.5*((1+'User Parameters'!C$48)^((12+UP_COC_WithholdLag)/12)-1),(X156+W156)*0.5*((1+'User Parameters'!$C$49)^((12+UP_COC_WithholdLag)/12)-1))","v":0},{"$f":"-'User Parameters'!$C$12*('User Parameters'!$C$13-1)","v":0},-0.30800431793791311,2.8161172407421565E-25,1.0715905998764159E-24,1.0715905998764159E-24,{"$f":"IF($AA156<-'Results Dashboard'!$J$7,$AA156+'Results Dashboard'!$J$7,0)","v":-0.27297464362513341},{"$f":"IF($AA156<-'Results Dashboard'!$J$8,$AA156+'Results Dashboard'!$J$8,0)","v":-0.2379449693123537},{"$f":"IF($AA156<-'Results Dashboard'!$J$9,$AA156+'Results Dashboard'!$J$9,0)","v":-0.2379449693123537},{"$f":"IF($AA156<-'Results Dashboard'!$J$11,$AA156+'Results Dashboard'!$J$11,0)","v":-0.15037078353040448},{"$f":"IF($AA156<-'Results Dashboard'!$J$10,$AA156+'Results Dashboard'!$J$10,0)","v":-0.15037078353040448},null,{"$f":"IF((X156+W156)>0,(X156+W156)*0.5*'User Parameters'!C$48,(X156+W156)*0.5*'User Parameters'!$C$49)","v":0},{"$f":"-'User Parameters'!$C$12*('User Parameters'!$C$13-1)","v":0},-0.30800431793791311]
[1.2250039253981022,454.54342697283204,556.81748230562482,1.2250039253981022,{"$f":"'User Parameters'!$C$10","v":40},{"$f":"B157*'User Parameters'!$C$14","v":0},-142.27405533279278,-0.31300431793791283,1.2250039253981022,{"$f":"IF(UP_RSBasis=\"MLR\",UP_RSTarget_MLR,IF(UP_RSBasis=\"Medical Baseline\",UP_RSTarget_Medlcal,0))","v":0},0,0,0,0,0,0,0,"",0,{"$f":"(S157+C157+'User Parameters'!$C$11)/(B157-F157)","v":1.2250039253981022},{"$f":"IF(T157<'User Parameters'!$J$5,'User Parameters'!$J$5,IF(T157>'User Parameters'!$J$6,'User Parameters'!$J$6,T157))","v":1.2250039253981022},0,0,{"$f":"(B157-C157-F157-E157-S157-V157)/'Results Dashboard'!$D$42","v":-0.31300431793791283},{"$f":"IF((X157+W157)>0,(X157+W157)*0.5*((1+'User Parameters'!C$48)^((12+UP_COC_WithholdLag)/12)-1),(X157+W157)*0.5*((1+'User Parameters'!$C$49)^((12+UP_COC_WithholdLag)/12)-1))","v":0},{"$f":"-'User Parameters'!$C$12*('User Parameters'!$C$13-1)","v":0},-0.31300431793791283,5.7282490780529787E-26,2.2432923329368585E-25,2.2432923329368585E-25,{"$f":"IF($AA157<-'Results Dashboard'!$J$7,$AA157+'Results Dashboard'!$J$7,0)","v":-0.27797464362513313},{"$f":"IF($AA157<-'Results Dashboard'!$J$8,$AA157+'Results Dashboard'!$J$8,0)","v":-0.24294496931235343},{"$f":"IF($AA157<-'Results Dashboard'!$J$9,$AA157+'Results Dashboard'!$J$9,0)","v":-0.24294496931235343},{"$f":"IF($AA157<-'Results Dashboard'!$J$11,$AA157+'Results Dashboard'!$J$11,0)","v":-0.15537078353040421},{"$f":"IF($AA157<-'Results Dashboard'!$J$10,$AA157+'Results Dashboard'!$J$10,0)","v":-0.15537078353040421},null,{"$f":"IF((X157+W157)>0,(X157+W157)*0.5*'User Parameters'!C$48,(X157+W157)*0.5*'User Parameters'!$C$49)","v":0},{"$f":"-'User Parameters'!$C$12*('User Parameters'!$C$13-1)","v":0},-0.31300431793791283]
[1.2300039253981021,454.54342697283204,559.09019944048896,1.2300039253981021,{"$f":"'User Parameters'!$C$10","v":40},{"$f":"B158*'User Parameters'!$C$14","v":0},-144.54677246765692,-0.31800431793791278,1.2300039253981021,{"$f":"IF(UP_RSBasis=\"MLR\",UP_RSTarget_MLR,IF(UP_RSBasis=\"Medical Baseline\",UP_RSTarget_Medlcal,0))","v":0},0,0,0,0,0,0,0,"",0,{"$f":"(S158+C158+'User Parameters'!$C$11)/(B158-F158)","v":1.2300039253981021},{"$f":"IF(T158<'User Parameters'!$J$5,'User Parameters'!$J$5,IF(T158>'User Parameters'!$J$6,'User Parameters'!$J$6,T158))","v":1.2300039253981021},0,0,{"$f":"(B158-C158-F158-E158-S158-V158)/'Results Dashboard'!$D$42","v":-0.31800431793791278},{"$f":"IF((X158+W158)>0,(X158+W158)*0.5*((1+'User Parameters'!C$48)^((12+UP_COC_WithholdLag)/12)-1),(X158+W158)*0.5*((1+'User Parameters'!$C$49)^((12+UP_COC_WithholdLag)/12)-1))","v":0},{"$f":"-'User Parameters'!$C$12*('User Parameters'!$C$13-1)","v":0},-0.31800431793791278,1.1388690442452864E-26,4.5893800338076923E-26,4.5893800338076923E-26,{"$f":"IF($AA158<-'Results Dashboard'!$J$7,$AA158+'Results Dashboard'!$J$7,0)","v":-0.28297464362513308},{"$f":"IF($AA158<-'Results Dashboard'!$J$8,$AA158+'Results Dashboard'!$J$8,0)","v":-0.24794496931235338},{"$f":"IF($AA158<-'Results Dashboard'!$J$9,$AA158+'Results Dashboard'!$J$9,0)","v":-0.24794496931235338},{"$f":"IF($AA158<-'Results Dashboard'!$J$11,$AA158+'Results Dashboard'!$J$11,0)","v":-0.16037078353040415},{"$f":"IF($AA158<-'Results Dashboard'!$J$10,$AA158+'Results Dashboard'!$J$10,0)","v":-0.16037078353040415},null,{"$f":"IF((X158+W158)>0,(X158+W158)*0.5*'User Parameters'!C$48,(X158+W158)*0.5*'User Parameters'!$C$49)","v":0},{"$f":"-'User Parameters'!$C$12*('User Parameters'!$C$13-1)","v":0},-0.31800431793791278]
[1.235003925398102,454.54342697283204,561.3629165753531,1.235003925398102,{"$f":"'User Parameters'!$C$10","v":40},{"$f":"B159*'User Parameters'!$C$14","v":0},-146.81948960252106,-0.32300431793791273,1.235003925398102,{"$f":"IF(UP_RSBasis=\"MLR\",UP_RSTarget_MLR,IF(UP_RSBasis=\"Medical Baseline\",UP_RSTarget_Medlcal,0))","v":0},0,0,0,0,0,0,0,"",0,{"$f":"(S159+C159+'User Parameters'!$C$11)/(B159-F159)","v":1.235003925398102},{"$f":"IF(T159<'User Parameters'!$J$5,'User Parameters'!$J$5,IF(T159>'User Parameters'!$J$6,'User Parameters'!$J$6,T159))","v":1.235003925398102},0,0,{"$f":"(B159-C159-F159-E159-S159-V159)/'Results Dashboard'!$D$42","v":-0.32300431793791273},{"$f":"IF((X159+W159)>0,(X159+W159)*0.5*((1+'User Parameters'!C$48)^((12+UP_COC_WithholdLag)/12)-1),(X159+W159)*0.5*((1+'User Parameters'!$C$49)^((12+UP_COC_WithholdLag)/12)-1))","v":0},{"$f":"-'User Parameters'!$C$12*('User Parameters'!$C$13-1)","v":0},-0.32300431793791273,2.2131154922794417E-27,9.175574950173423E-27,9.175574950173423E-27,{"$f":"IF($AA159<-'Results Dashboard'!$J$7,$AA159+'Results Dashboard'!$J$7,0)","v":-0.28797464362513303},{"$f":"IF($AA159<-'Results Dashboard'!$J$8,$AA159+'Results Dashboard'!$J$8,0)","v":-0.25294496931235333},{"$f":"IF($AA159<-'Results Dashboard'!$J$9,$AA159+'Results Dashboard'!$J$9,0)","v":-0.25294496931235333},{"$f":"IF($AA159<-'Results Dashboard'!$J$11,$AA159+'Results Dashboard'!$J$11,0)","v":-0.1653707835304041},{"$f":"IF($AA159<-'Results Dashboard'!$J$10,$AA159+'Results Dashboard'!$J$10,0)","v":-0.1653707835304041},null,{"$f":"IF((X159+W159)>0,(X159+W159)*0.5*'User Parameters'!C$48,(X159+W159)*0.5*'User Parameters'!$C$49)","v":0},{"$f":"-'User Parameters'!$C$12*('User Parameters'!$C$13-1)","v":0},-0.32300431793791273]
[1.2400039253981019,454.54342697283204,563.63563371021723,1.2400039253981019,{"$f":"'User Parameters'!$C$10","v":40},{"$f":"B160*'User Parameters'!$C$14","v":0},-149.0922067373852,-0.32800431793791268,1.2400039253981019,{"$f":"IF(UP_RSBasis=\"MLR\",UP_RSTarget_MLR,IF(UP_RSBasis=\"Medical Baseline\",UP_RSTarget_Medlcal,0))","v":0},0,0,0,0,0,0,0,"",0,{"$f":"(S160+C160+'User Parameters'!$C$11)/(B160-F160)","v":1.2400039253981019},{"$f":"IF(T160<'User Parameters'!$J$5,'User Parameters'!$J$5,IF(T160>'User Parameters'!$J$6,'User Parameters'!$J$6,T160))","v":1.2400039253981019},0,0,{"$f":"(B160-C160-F160-E160-S160-V160)/'Results Dashboard'!$D$42","v":-0.32800431793791268},{"$f":"IF((X160+W160)>0,(X160+W160)*0.5*((1+'User Parameters'!C$48)^((12+UP_COC_WithholdLag)/12)-1),(X160+W160)*0.5*((1+'User Parameters'!$C$49)^((12+UP_COC_WithholdLag)/12)-1))","v":0},{"$f":"-'User Parameters'!$C$12*('User Parameters'!$C$13-1)","v":0},-0.32800431793791268,4.2034948380871227E-28,1.7927660084707293E-27,1.7927660084707293E-27,{"$f":"IF($AA160<-'Results Dashboard'!$J$7,$AA160+'Results Dashboard'!$J$7,0)","v":-0.29297464362513298},{"$f":"IF($AA160<-'Results Dashboard'!$J$8,$AA160+'Results Dashboard'!$J$8,0)","v":-0.25794496931235328},{"$f":"IF($AA160<-'Results Dashboard'!$J$9,$AA160+'Results Dashboard'!$J$9,0)","v":-0.25794496931235328},{"$f":"IF($AA160<-'Results Dashboard'!$J$11,$AA160+'Results Dashboard'!$J$11,0)","v":-0.17037078353040405},{"$f":"IF($AA160<-'Results Dashboard'!$J$10,$AA160+'Results Dashboard'!$J$10,0)","v":-0.17037078353040405},null,{"$f":"IF((X160+W160)>0,(X160+W160)*0.5*'User Parameters'!C$48,(X160+W160)*0.5*'User Parameters'!$C$49)","v":0},{"$f":"-'User Parameters'!$C$12*('User Parameters'!$C$13-1)","v":0},-0.32800431793791268]
[1.2450039253981018,454.54342697283204,565.90835084508126,1.2450039253981018,{"$f":"'User Parameters'!$C$10","v":40},{"$f":"B161*'User Parameters'!$C$14","v":0},-151.36492387224922,-0.33300431793791241,1.2450039253981018,{"$f":"IF(UP_RSBasis=\"MLR\",UP_RSTarget_MLR,IF(UP_RSBasis=\"Medical Baseline\",UP_RSTarget_Medlcal,0))","v":0},0,0,0,0,0,0,0,"",0,{"$f":"(S161+C161+'User Parameters'!$C$11)/(B161-F161)","v":1.2450039253981018},{"$f":"IF(T161<'User Parameters'!$J$5,'User Parameters'!$J$5,IF(T161>'User Parameters'!$J$6,'User Parameters'!$J$6,T161))","v":1.2450039253981018},0,0,{"$f":"(B161-C161-F161-E161-S161-V161)/'Results Dashboard'!$D$42","v":-0.33300431793791241},{"$f":"IF((X161+W161)>0,(X161+W161)*0.5*((1+'User Parameters'!C$48)^((12+UP_COC_WithholdLag)/12)-1),(X161+W161)*0.5*((1+'User Parameters'!$C$49)^((12+UP_COC_WithholdLag)/12)-1))","v":0},{"$f":"-'User Parameters'!$C$12*('User Parameters'!$C$13-1)","v":0},-0.33300431793791241,7.8035272457020886E-29,3.4231421135169136E-28,3.4231421135169136E-28,{"$f":"IF($AA161<-'Results Dashboard'!$J$7,$AA161+'Results Dashboard'!$J$7,0)","v":-0.29797464362513271},{"$f":"IF($AA161<-'Results Dashboard'!$J$8,$AA161+'Results Dashboard'!$J$8,0)","v":-0.26294496931235301},{"$f":"IF($AA161<-'Results Dashboard'!$J$9,$AA161+'Results Dashboard'!$J$9,0)","v":-0.26294496931235301},{"$f":"IF($AA161<-'Results Dashboard'!$J$11,$AA161+'Results Dashboard'!$J$11,0)","v":-0.17537078353040378},{"$f":"IF($AA161<-'Results Dashboard'!$J$10,$AA161+'Results Dashboard'!$J$10,0)","v":-0.17537078353040378},null,{"$f":"IF((X161+W161)>0,(X161+W161)*0.5*'User Parameters'!C$48,(X161+W161)*0.5*'User Parameters'!$C$49)","v":0},{"$f":"-'User Parameters'!$C$12*('User Parameters'!$C$13-1)","v":0},-0.33300431793791241]
[1.2500039253981017,454.54342697283204,568.1810679799454,1.2500039253981017,{"$f":"'User Parameters'!$C$10","v":40},{"$f":"B162*'User Parameters'!$C$14","v":0},-153.63764100711336,-0.33800431793791236,1.2500039253981017,{"$f":"IF(UP_RSBasis=\"MLR\",UP_RSTarget_MLR,IF(UP_RSBasis=\"Medical Baseline\",UP_RSTarget_Medlcal,0))","v":0},0,0,0,0,0,0,0,"",0,{"$f":"(S162+C162+'User Parameters'!$C$11)/(B162-F162)","v":1.2500039253981017},{"$f":"IF(T162<'User Parameters'!$J$5,'User Parameters'!$J$5,IF(T162>'User Parameters'!$J$6,'User Parameters'!$J$6,T162))","v":1.2500039253981017},0,0,{"$f":"(B162-C162-F162-E162-S162-V162)/'Results Dashboard'!$D$42","v":-0.33800431793791236},{"$f":"IF((X162+W162)>0,(X162+W162)*0.5*((1+'User Parameters'!C$48)^((12+UP_COC_WithholdLag)/12)-1),(X162+W162)*0.5*((1+'User Parameters'!$C$49)^((12+UP_COC_WithholdLag)/12)-1))","v":0},{"$f":"-'User Parameters'!$C$12*('User Parameters'!$C$13-1)","v":0},-0.33800431793791236,1.415934948393232E-29,6.3875922973088565E-29,6.3875922973088565E-29,{"$f":"IF($AA162<-'Results Dashboard'!$J$7,$AA162+'Results Dashboard'!$J$7,0)","v":-0.30297464362513266},{"$f":"IF($AA162<-'Results Dashboard'!$J$8,$AA162+'Results Dashboard'!$J$8,0)","v":-0.26794496931235295},{"$f":"IF($AA162<-'Results Dashboard'!$J$9,$AA162+'Results Dashboard'!$J$9,0)","v":-0.26794496931235295},{"$f":"IF($AA162<-'Results Dashboard'!$J$11,$AA162+'Results Dashboard'!$J$11,0)","v":-0.18037078353040373},{"$f":"IF($AA162<-'Results Dashboard'!$J$10,$AA162+'Results Dashboard'!$J$10,0)","v":-0.18037078353040373},null,{"$f":"IF((X162+W162)>0,(X162+W162)*0.5*'User Parameters'!C$48,(X162+W162)*0.5*'User Parameters'!$C$49)","v":0},{"$f":"-'User Parameters'!$C$12*('User Parameters'!$C$13-1)","v":0},-0.33800431793791236]
[1.2550039253981016,454.54342697283204,570.45378511480953,1.2550039253981016,{"$f":"'User Parameters'!$C$10","v":40},{"$f":"B163*'User Parameters'!$C$14","v":0},-155.9103581419775,-0.34300431793791231,1.2550039253981016,{"$f":"IF(UP_RSBasis=\"MLR\",UP_RSTarget_MLR,IF(UP_RSBasis=\"Medical Baseline\",UP_RSTarget_Medlcal,0))","v":0},0,0,0,0,0,0,0,"",0,{"$f":"(S163+C163+'User Parameters'!$C$11)/(B163-F163)","v":1.2550039253981016},{"$f":"IF(T163<'User Parameters'!$J$5,'User Parameters'!$J$5,IF(T163>'User Parameters'!$J$6,'User Parameters'!$J$6,T163))","v":1.2550039253981016},0,0,{"$f":"(B163-C163-F163-E163-S163-V163)/'Results Dashboard'!$D$42","v":-0.34300431793791231},{"$f":"IF((X163+W163)>0,(X163+W163)*0.5*((1+'User Parameters'!C$48)^((12+UP_COC_WithholdLag)/12)-1),(X163+W163)*0.5*((1+'User Parameters'!$C$49)^((12+UP_COC_WithholdLag)/12)-1))","v":0},{"$f":"-'User Parameters'!$C$12*('User Parameters'!$C$13-1)","v":0},-0.34300431793791231,2.5111090477238216E-30,1.1648240436208499E-29,1.1648240436208499E-29,{"$f":"IF($AA163<-'Results Dashboard'!$J$7,$AA163+'Results Dashboard'!$J$7,0)","v":-0.3079746436251326},{"$f":"IF($AA163<-'Results Dashboard'!$J$8,$AA163+'Results Dashboard'!$J$8,0)","v":-0.2729449693123529},{"$f":"IF($AA163<-'Results Dashboard'!$J$9,$AA163+'Results Dashboard'!$J$9,0)","v":-0.2729449693123529},{"$f":"IF($AA163<-'Results Dashboard'!$J$11,$AA163+'Results Dashboard'!$J$11,0)","v":-0.18537078353040368},{"$f":"IF($AA163<-'Results Dashboard'!$J$10,$AA163+'Results Dashboard'!$J$10,0)","v":-0.18537078353040368},null,{"$f":"IF((X163+W163)>0,(X163+W163)*0.5*'User Parameters'!C$48,(X163+W163)*0.5*'User Parameters'!$C$49)","v":0},{"$f":"-'User Parameters'!$C$12*('User Parameters'!$C$13-1)","v":0},-0.34300431793791231]
[1.2600039253981015,454.54342697283204,572.72650224967367,1.2600039253981015,{"$f":"'User Parameters'!$C$10","v":40},{"$f":"B164*'User Parameters'!$C$14","v":0},-158.18307527684163,-0.34800431793791226,1.2600039253981015,{"$f":"IF(UP_RSBasis=\"MLR\",UP_RSTarget_MLR,IF(UP_RSBasis=\"Medical Baseline\",UP_RSTarget_Medlcal,0))","v":0},0,0,0,0,0,0,0,"",0,{"$f":"(S164+C164+'User Parameters'!$C$11)/(B164-F164)","v":1.2600039253981015},{"$f":"IF(T164<'User Parameters'!$J$5,'User Parameters'!$J$5,IF(T164>'User Parameters'!$J$6,'User Parameters'!$J$6,T164))","v":1.2600039253981015},0,0,{"$f":"(B164-C164-F164-E164-S164-V164)/'Results Dashboard'!$D$42","v":-0.34800431793791226},{"$f":"IF((X164+W164)>0,(X164+W164)*0.5*((1+'User Parameters'!C$48)^((12+UP_COC_WithholdLag)/12)-1),(X164+W164)*0.5*((1+'User Parameters'!$C$49)^((12+UP_COC_WithholdLag)/12)-1))","v":0},{"$f":"-'User Parameters'!$C$12*('User Parameters'!$C$13-1)","v":0},-0.34800431793791226,4.3526710261996925E-31,2.0758419451038523E-30,2.0758419451038523E-30,{"$f":"IF($AA164<-'Results Dashboard'!$J$7,$AA164+'Results Dashboard'!$J$7,0)","v":-0.31297464362513255},{"$f":"IF($AA164<-'Results Dashboard'!$J$8,$AA164+'Results Dashboard'!$J$8,0)","v":-0.27794496931235285},{"$f":"IF($AA164<-'Results Dashboard'!$J$9,$AA164+'Results Dashboard'!$J$9,0)","v":-0.27794496931235285},{"$f":"IF($AA164<-'Results Dashboard'!$J$11,$AA164+'Results Dashboard'!$J$11,0)","v":-0.19037078353040363},{"$f":"IF($AA164<-'Results Dashboard'!$J$10,$AA164+'Results Dashboard'!$J$10,0)","v":-0.19037078353040363},null,{"$f":"IF((X164+W164)>0,(X164+W164)*0.5*'User Parameters'!C$48,(X164+W164)*0.5*'User Parameters'!$C$49)","v":0},{"$f":"-'User Parameters'!$C$12*('User Parameters'!$C$13-1)","v":0},-0.34800431793791226]
[1.2650039253981014,454.54342697283204,574.9992193845377,1.2650039253981011,{"$f":"'User Parameters'!$C$10","v":40},{"$f":"B165*'User Parameters'!$C$14","v":0},-160.45579241170566,-0.35300431793791193,1.2650039253981011,{"$f":"IF(UP_RSBasis=\"MLR\",UP_RSTarget_MLR,IF(UP_RSBasis=\"Medical Baseline\",UP_RSTarget_Medlcal,0))","v":0},0,0,0,0,0,0,0,"",0,{"$f":"(S165+C165+'User Parameters'!$C$11)/(B165-F165)","v":1.2650039253981011},{"$f":"IF(T165<'User Parameters'!$J$5,'User Parameters'!$J$5,IF(T165>'User Parameters'!$J$6,'User Parameters'!$J$6,T165))","v":1.2650039253981011},0,0,{"$f":"(B165-C165-F165-E165-S165-V165)/'Results Dashboard'!$D$42","v":-0.35300431793791193},{"$f":"IF((X165+W165)>0,(X165+W165)*0.5*((1+'User Parameters'!C$48)^((12+UP_COC_WithholdLag)/12)-1),(X165+W165)*0.5*((1+'User Parameters'!$C$49)^((12+UP_COC_WithholdLag)/12)-1))","v":0},{"$f":"-'User Parameters'!$C$12*('User Parameters'!$C$13-1)","v":0},-0.35300431793791193,7.3741550707031257E-32,3.6152555191293801E-31,3.6152555191293801E-31,{"$f":"IF($AA165<-'Results Dashboard'!$J$7,$AA165+'Results Dashboard'!$J$7,0)","v":-0.31797464362513223},{"$f":"IF($AA165<-'Results Dashboard'!$J$8,$AA165+'Results Dashboard'!$J$8,0)","v":-0.28294496931235252},{"$f":"IF($AA165<-'Results Dashboard'!$J$9,$AA165+'Results Dashboard'!$J$9,0)","v":-0.28294496931235252},{"$f":"IF($AA165<-'Results Dashboard'!$J$11,$AA165+'Results Dashboard'!$J$11,0)","v":-0.1953707835304033},{"$f":"IF($AA165<-'Results Dashboard'!$J$10,$AA165+'Results Dashboard'!$J$10,0)","v":-0.1953707835304033},null,{"$f":"IF((X165+W165)>0,(X165+W165)*0.5*'User Parameters'!C$48,(X165+W165)*0.5*'User Parameters'!$C$49)","v":0},{"$f":"-'User Parameters'!$C$12*('User Parameters'!$C$13-1)","v":0},-0.35300431793791193]
[1.2700039253981013,454.54342697283204,577.27193651940183,1.2700039253981013,{"$f":"'User Parameters'!$C$10","v":40},{"$f":"B166*'User Parameters'!$C$14","v":0},-162.7285095465698,-0.35800431793791188,1.2700039253981013,{"$f":"IF(UP_RSBasis=\"MLR\",UP_RSTarget_MLR,IF(UP_RSBasis=\"Medical Baseline\",UP_RSTarget_Medlcal,0))","v":0},0,0,0,0,0,0,0,"",0,{"$f":"(S166+C166+'User Parameters'!$C$11)/(B166-F166)","v":1.2700039253981013},{"$f":"IF(T166<'User Parameters'!$J$5,'User Parameters'!$J$5,IF(T166>'User Parameters'!$J$6,'User Parameters'!$J$6,T166))","v":1.2700039253981013},0,0,{"$f":"(B166-C166-F166-E166-S166-V166)/'Results Dashboard'!$D$42","v":-0.35800431793791188},{"$f":"IF((X166+W166)>0,(X166+W166)*0.5*((1+'User Parameters'!C$48)^((12+UP_COC_WithholdLag)/12)-1),(X166+W166)*0.5*((1+'User Parameters'!$C$49)^((12+UP_COC_WithholdLag)/12)-1))","v":0},{"$f":"-'User Parameters'!$C$12*('User Parameters'!$C$13-1)","v":0},-0.35800431793791188,1.2210488958265112E-32,6.1531061748766143E-32,6.1531061748766143E-32,{"$f":"IF($AA166<-'Results Dashboard'!$J$7,$AA166+'Results Dashboard'!$J$7,0)","v":-0.32297464362513217},{"$f":"IF($AA166<-'Results Dashboard'!$J$8,$AA166+'Results Dashboard'!$J$8,0)","v":-0.28794496931235247},{"$f":"IF($AA166<-'Results Dashboard'!$J$9,$AA166+'Results Dashboard'!$J$9,0)","v":-0.28794496931235247},{"$f":"IF($AA166<-'Results Dashboard'!$J$11,$AA166+'Results Dashboard'!$J$11,0)","v":-0.20037078353040325},{"$f":"IF($AA166<-'Results Dashboard'!$J$10,$AA166+'Results Dashboard'!$J$10,0)","v":-0.20037078353040325},null,{"$f":"IF((X166+W166)>0,(X166+W166)*0.5*'User Parameters'!C$48,(X166+W166)*0.5*'User Parameters'!$C$49)","v":0},{"$f":"-'User Parameters'!$C$12*('User Parameters'!$C$13-1)","v":0},-0.35800431793791188]
[1.2750039253981011,454.54342697283204,579.54465365426597,1.2750039253981011,{"$f":"'User Parameters'!$C$10","v":40},{"$f":"B167*'User Parameters'!$C$14","v":0},-165.00122668143393,-0.36300431793791182,{"$f":"($C167+UP_QIPMPM)/($B167-$F167)","v":1.2750039253981011},{"$f":"IF(UP_RSBasis=\"MLR\",UP_RSTarget_MLR,IF(UP_RSBasis=\"Medical Baseline\",UP_RSTarget_Medlcal,0))","v":0},0,0,0,0,0,0,0,"",0,{"$f":"(S167+C167+'User Parameters'!$C$11)/(B167-F167)","v":1.2750039253981011},{"$f":"IF(T167<'User Parameters'!$J$5,'User Parameters'!$J$5,IF(T167>'User Parameters'!$J$6,'User Parameters'!$J$6,T167))","v":1.2750039253981011},0,0,{"$f":"(B167-C167-F167-E167-S167-V167)/'Results Dashboard'!$D$42","v":-0.36300431793791182},{"$f":"IF((X167+W167)>0,(X167+W167)*0.5*((1+'User Parameters'!C$48)^((12+UP_COC_WithholdLag)/12)-1),(X167+W167)*0.5*((1+'User Parameters'!$C$49)^((12+UP_COC_WithholdLag)/12)-1))","v":0},{"$f":"-'User Parameters'!$C$12*('User Parameters'!$C$13-1)","v":0},-0.36300431793791182,1.9761344714458037E-33,1.0234354486819308E-32,1.0234354486819308E-32,{"$f":"IF($AA167<-'Results Dashboard'!$J$7,$AA167+'Results Dashboard'!$J$7,0)","v":-0.32797464362513212},{"$f":"IF($AA167<-'Results Dashboard'!$J$8,$AA167+'Results Dashboard'!$J$8,0)","v":-0.29294496931235242},{"$f":"IF($AA167<-'Results Dashboard'!$J$9,$AA167+'Results Dashboard'!$J$9,0)","v":-0.29294496931235242},{"$f":"IF($AA167<-'Results Dashboard'!$J$11,$AA167+'Results Dashboard'!$J$11,0)","v":-0.20537078353040319},{"$f":"IF($AA167<-'Results Dashboard'!$J$10,$AA167+'Results Dashboard'!$J$10,0)","v":-0.20537078353040319},null,{"$f":"IF((X167+W167)>0,(X167+W167)*0.5*'User Parameters'!C$48,(X167+W167)*0.5*'User Parameters'!$C$49)","v":0},{"$f":"-'User Parameters'!$C$12*('User Parameters'!$C$13-1)","v":0},-0.36300431793791182]
[1.280003925398101,454.54342697283204,581.81737078913011,1.280003925398101,{"$f":"'User Parameters'!$C$10","v":40},{"$f":"B168*'User Parameters'!$C$14","v":0},-167.27394381629807,-0.36800431793791177,1.280003925398101,{"$f":"IF(UP_RSBasis=\"MLR\",UP_RSTarget_MLR,IF(UP_RSBasis=\"Medical Baseline\",UP_RSTarget_Medlcal,0))","v":0},{"$f":"IF(UP_RSBasis=\"MLR\",J168-I168,IF(UP_RSBasis=\"Medical Baseline\",J168-$C168,0))","v":0},0,0,0,0,0,0,{"$f":"IF(UP_RSBasis=\"MLR\",SUMPRODUCT(L$4:Q$4,L168:Q168),\"\")","v":""},{"$f":"IF(UP_RSBasis=\"MLR\",R168*(B168-F168),SUMPRODUCT($L$4:$Q$4,$L168:$Q168))","v":0},{"$f":"(S168+C168+'User Parameters'!$C$11)/(B168-F168)","v":1.280003925398101},{"$f":"IF(T168<'User Parameters'!$J$5,'User Parameters'!$J$5,IF(T168>'User Parameters'!$J$6,'User Parameters'!$J$6,T168))","v":1.280003925398101},{"$f":"(U168-T168)*(B168-F168)","v":0},{"$f":"V168/B168","v":0},{"$f":"(B168-C168-F168-E168-S168-V168)/'Results Dashboard'!$D$42","v":-0.36800431793791177},{"$f":"IF((X168+W168)>0,(X168+W168)*0.5*((1+'User Parameters'!C$48)^((12+UP_COC_WithholdLag)/12)-1),(X168+W168)*0.5*((1+'User Parameters'!$C$49)^((12+UP_COC_WithholdLag)/12)-1))","v":0},{"$f":"-'User Parameters'!$C$12*('User Parameters'!$C$13-1)","v":0},-0.36800431793791177,3.1257981232204026E-34,1.6635546591237635E-33,{"$f":"AC168+(1-AC5)/2","v":2.7755575615628914E-16},{"$f":"IF($AA168<-'Results Dashboard'!$J$7,$AA168+'Results Dashboard'!$J$7,0)","v":-0.33297464362513207},{"$f":"IF($AA168<-'Results Dashboard'!$J$8,$AA168+'Results Dashboard'!$J$8,0)","v":-0.29794496931235237},{"$f":"IF($AA168<-'Results Dashboard'!$J$9,$AA168+'Results Dashboard'!$J$9,0)","v":-0.29794496931235237},{"$f":"IF($AA168<-'Results Dashboard'!$J$11,$AA168+'Results Dashboard'!$J$11,0)","v":-0.21037078353040314},{"$f":"IF($AA168<-'Results Dashboard'!$J$10,$AA168+'Results Dashboard'!$J$10,0)","v":-0.21037078353040314},null,{"$f":"IF((X168+W168)>0,(X168+W168)*0.5*'User Parameters'!C$48,(X168+W168)*0.5*'User Parameters'!$C$49)","v":0},{"$f":"-'User Parameters'!$C$12*('User Parameters'!$C$13-1)","v":0},-0.36800431793791177]

{"sheet":"Drop Downs","index":7,"n_rows":110,"n_cols":5,"rows_kept":110,"cut":false,"hidden":true,"merged":[]}
[]
["Yes/No Toggle"]
["Yes"]
["No"]
[]
[]
["Interest Rate for Cost of Debt (%)"]
["Moderate (Proxy: Baa Yield)",{"$f":"'Treasury and Corporate Yields'!F9","v":4.1129508196721315E-2}]
["Low-Cost (Proxy: Aaa Yield)",{"$f":"'Treasury and Corporate Yields'!E9","v":3.2429508196721309E-2}]
["User-Defined",{"$f":"'User Parameters'!J40","v":0}]
[]
[]
["Risk-Free Rate (%)"]
["3-Month Treasury",{"$f":"'Treasury and Corporate Yields'!B9","v":1.0529508196721316E-2}]
["10-Yr Treasury",{"$f":"'Treasury and Corporate Yields'!C9","v":1.9411475409836069E-2}]
["20-Yr Treasury",{"$f":"'Treasury and Corporate Yields'!D9","v":2.278852459016394E-2}]
["User-Defined",{"$f":"'User Parameters'!J37","v":0}]
[]
[]
["Benchmark Expected Rates of Returns & Beta","Return","Beta"]
["S&P 500",{"$f":"'Equity Premium'!B13","v":0.12606036725596867},{"$f":"'Equity Premium'!B14","v":1}]
["Select Insurers",{"$f":"'Equity Premium'!C13","v":0.15962362008747938},{"$f":"'Equity Premium'!C14","v":0.96817948486192729}]
["Select Utilities",{"$f":"'Equity Premium'!D13","v":9.4752665689721058E-2},{"$f":"'Equity Premium'!D14","v":0.38223439074477483}]
["User-Defined",null,{"$f":"'User Parameters'!J38","v":1}]
[]
[]
["Equity Premium"]
["CAPM Calculated",{"$f":"UP_COC_Beta*((B21)-(UP_COC_RiskFreeRate))","v":9.9985679432920832E-2}]
["Implied Eq. Risk Prem. (Damodaran)",{"$f":"'Equity Premium'!E13","v":5.3313888888888897E-2}]
["User-Defined",{"$f":"'User Parameters'!J39","v":0}]
[]
["Factor to Apply to Calculate Cost of Withhold"]
["Cost of Debt",{"$f":"CostOfDebt","v":2.838347360655738E-2}]
["Cost of Equity",{"$f":"CostOfEquity","v":7.6102413479052833E-2}]
["Weighted Average Cost of Capital",{"$f":"WACC","v":7.6102413479052833E-2}]
["None",0]
["User-Defined",{"$f":"'User Parameters'!J42","v":0}]
[]
[]
["Discounting Methodology"]
["No Discount",0]
["Eliminate Risk-Free Rate",{"$f":"'COC Calculation'!C58*'COC Calculation'!C69","v":2.278852459016394E-2},null,"Value of risk-free rate relative to % of equity held"]
["Investment Earnings",3.6999999999999998E-2,null,"Source: NAIC filings, 2015-2019 average from S&P Global: [KeyField:230370, NET_INVEST_INC_EARNED_ANNUITY] / [KeyField:123210, ADJ_CAPITAL]; from NAIC:"]
["User-Defined",{"$f":"'User Parameters'!J41","v":0},null,null,"2020 Annual: P4, Row 25, Col 2;; P15, Row 17, Col 2;; PSupp 214.1, Row 3"]
[null,null,null,null,"2020 Annual: P29, Row 14, Col 1"]
[]
["Calculation Targets"]
["Probability of Ruin"]
["Net Income Before Taxes"]
["Risk Margin"]
[]
[]
[]
["Data For Ruin Calculations:"]
["Probability of Ruin Target",{"$f":"UP_Target_Level","v":0.02}]
["Estimated RBC as % of Premium at the Ruin Target",{"$f":"TREND('Results Dashboard'!J9:J10,'Results Dashboard'!K9:K10,B55)","v":-1.3022853056582151}]
["Difference between Target RBC and Ruin RBC",{"$f":"B56-'Results Dashboard'!J11","v":-1.4599188400657237}]
[]
[]
["Risk Share Target"]
["No Risk Share"]
["MLR"]
["Medical Baseline"]
[]
[]
["Income Matrix - Interest Income on Gains"]
["3-Month Treasury",{"$f":"'Treasury and Corporate Yields'!B9","v":1.0529508196721316E-2}]
["Cost of Debt",{"$f":"B33","v":2.838347360655738E-2}]
["Cost of Equity",{"$f":"B34","v":7.6102413479052833E-2}]
["Weighted Average Cost of Capital",{"$f":"B35","v":7.6102413479052833E-2}]
["None",0]
["User-Defined",{"$f":"'User Parameters'!J43","v":0}]
[]
[]
["Income Matrix - Interest Expense on Losses"]
["3-Month Treasury",{"$f":"'Treasury and Corporate Yields'!B9","v":1.0529508196721316E-2}]
["Cost of Debt",{"$f":"B33","v":2.838347360655738E-2}]
["Cost of Equity",{"$f":"B34","v":7.6102413479052833E-2}]
["Weighted Average Cost of Capital",{"$f":"B35","v":7.6102413479052833E-2}]
["None",0]
["User-Defined",{"$f":"'User Parameters'!J44","v":0}]
[]
[]
["Authorized Control Level Prompt"]
["NAIC Filings + User Parameters",{"$f":"ACL_Percent","v":3.5029674312779695E-2}]
["NAIC Filings (Medicaid-Dominant)",{"$f":"'RBC Weights'!D12","v":3.2191571853645122E-2}]
["NAIC Filings (All)",{"$f":"'RBC Weights'!C12","v":3.5029674312779695E-2}]
["User-Defined",{"$f":"'User Parameters'!J35","v":0}]
[]
[]
["Authorized Control Level Source"]
["NAIC Average (Medicaid-Dominant)"]
["NAIC Average (All)"]
["User-Defined"]
[]
[]
["NAIC Filings"]
["Medicaid-Dominant"]
["All Filings"]
[]
[]
["Historical Time Horizons for Expected Rates of Returns & Betas"]
["10-Year"]
["5-Year"]
["3-Year"]
[]
[]
["Tax Treatment of Cost of Equity"]
["After-Tax"]
["Pre-Tax"]

{"sheet":"RBC Weights","index":8,"n_rows":62,"n_cols":11,"rows_kept":62,"cut":false,"hidden":true,"merged":[[20,1,20,6],[20,8,20,10],[15,0,15,2]]}
["Calculation of Relative Weights of RBC Risk Factors"]
[]
["Selection Criteria:",{"$f":"UP_COC_Selection_H4","v":"Medicaid-Dominant"}]
[]
["Relative Contribution to ACL:","SELECTED","ALL FILINGS","MEDICAID-DOMINANT FILINGS"]
["H0",{"$f":"IF($B$3=\"Medicaid-Dominant\",D6,C6)","v":2.5336962234345423E-2},{"$f":"B32","v":0.1127281279261159},{"$f":"I32","v":2.5336962234345423E-2}]
["H1^2",{"$f":"IF($B$3=\"Medicaid-Dominant\",D7,C7)","v":8.4931946684462842E-2},{"$f":"B33","v":0.22199950203609375},{"$f":"I33","v":8.4931946684462842E-2}]
["H2^2",{"$f":"IF($B$3=\"Medicaid-Dominant\",D8,C8)","v":1},{"$f":"B34","v":1},{"$f":"I34","v":1}]
["H3^2",{"$f":"IF($B$3=\"Medicaid-Dominant\",D9,C9)","v":5.4019580704334283E-2},{"$f":"B35","v":8.4041647614931658E-2},{"$f":"I35","v":5.4019580704334283E-2}]
["H4^2",{"$f":"IF($B$3=\"Medicaid-Dominant\",D10,C10)","v":7.4121569807405724E-2},{"$f":"B36","v":0.15588864942248731},{"$f":"I36","v":7.4121569807405724E-2}]
[]
["ACL % of Revenue",{"$f":"IF($B$3=\"Medicaid-Dominant\",D12,C12)","v":3.2191571853645122E-2},{"$f":"B47","v":3.5029674312779695E-2},{"$f":"I47","v":3.2191571853645122E-2}]
["Aggregate RBC%",{"$f":"IF($B$3=\"Medicaid-Dominant\",D13,C13)","v":4.3611916172156286},{"$f":"B58","v":5.8739999999999997},{"$f":"I58","v":4.3611916172156286}]
["Median RBC%",{"$f":"IF($B$3=\"Medicaid-Dominant\",D14,C14)","v":4.1950000000000003},{"$f":"B59","v":6.418000000000001},{"$f":"I59","v":4.1950000000000003}]
[]
["\"ALL FILINGS\" data from NAIC (2021, June 30) \"Aggregated Health Risk-Based Capital Data\" Retrieved on March 21, 2022, from: https://content.naic.org/sites/default/files/inline-files/2020%20Health%20RBC%20Statistics_as%20of%202020-06-30.pdf"]
["\"MEDICAID-DOMINANT FILINGS\" from NAIC via Kevin Russell FSA, MAAA (Mercer). Received on February 15, 2022. "]
[]
["Include CY 2020","Yes"]
[]
[null,"Health RBC excluding ACA Fees",null,null,null,null,null,null,"Medicaid Dominant Health RBC Only excluding ACA Fees"]
[null,"Selected Period Average",2020,2019,2018,2017,2016,null,"2-Year Average",2020,2019]
[]
["H0 - ASSET RISK - AFFILIATES W/RBC",{"$f":"IF($B$19=\"Yes\",AVERAGE(C24:G24),AVERAGE(D24:G24))","v":4657710234.6000004},5192392682,4782424393,4487634571,4332880131,4493219396,null,{"$f":"IF($B$19=\"Yes\",AVERAGE(J24:K24),AVERAGE(K24))","v":335724340},324883630,346565050]
["H1 - ASSET RISK - OTHER",{"$f":"IF($B$19=\"Yes\",AVERAGE(C25:G25),AVERAGE(D25:G25))","v":9172594025.3999996},11292103225,9743938557,8589245210,8315790867,7921892268,null,{"$f":"IF($B$19=\"Yes\",AVERAGE(J25:K25),AVERAGE(K25))","v":1125380441.5},1017470455,1233290428]
["H2 - UNDERWRITING RISK",{"$f":"IF($B$19=\"Yes\",AVERAGE(C26:G26),AVERAGE(D26:G26))","v":41318083785.199997},45819164666,44037638071,40572604055,38787031590,37373980544,null,13250378514,12847292785,13653464243]
["H3 - CREDIT RISK",{"$f":"IF($B$19=\"Yes\",AVERAGE(C27:G27),AVERAGE(D27:G27))","v":3472439837.5999999},4199732859,3626933231,3408034022,3143155975,2984343101,null,715779891.5,619818601,811741182]
["H4 - BUSINESS RISK",{"$f":"IF($B$19=\"Yes\",AVERAGE(C28:G28),AVERAGE(D28:G28))","v":6441020278},7481764896,6571143274,6468297728,5739438653,5944456839,null,982138856,861166718,1103110994]
["TOTAL RBC BEFORE COVARIANCE",{"$f":"SUM(B24:B28)","v":65061848160.799995},73985158328,68762077526,63525815586,60318297216,58717892148,null,16409402043,{"$f":"SUM(J24:J28)","v":15670632189},17148171897]
[]
["Weights of Risks Relative to (H2) Underwriting Risk"]
["H0 - ASSET RISK - AFFILIATES W/RBC",{"$f":"B24/B$26","v":0.1127281279261159},{"$f":"C24/C$26","v":0.11332359984844949},{"$f":"D24/D$26","v":0.10859856710047668},0.11060750660511184,0.11170950581629699,0.12022319620759098,null,{"$f":"I24/I$26","v":2.5336962234345423E-2},0,0]
["H1 - ASSET RISK - OTHER",{"$f":"B25/B$26","v":0.22199950203609375},{"$f":"C25/C$26","v":0.24644934728326198},{"$f":"D25/D$26","v":0.221263877533356},0.21170061449239161,0.21439616609237924,0.21196276534348912,null,{"$f":"I25/I$26","v":8.4931946684462842E-2},{"$f":"J25/J$26","v":7.9197265293740243E-2},9.0328022694481813E-2]
["H2 - UNDERWRITING RISK",{"$f":"B26/B$26","v":1},1,{"$f":"D26/D$26","v":1},1,1,1,null,{"$f":"I26/I$26","v":1},1,1]
["H3 - CREDIT RISK",{"$f":"B27/B$26","v":8.4041647614931658E-2},9.1658870029911341E-2,{"$f":"D27/D$26","v":8.2359849207908259E-2},8.3998404868962512E-2,8.1036259959897591E-2,7.9850822886969819E-2,null,{"$f":"I27/I$26","v":5.4019580704334283E-2},4.8245074769657004E-2,5.9453129810346256E-2]
["H4 - BUSINESS RISK",{"$f":"B28/B$26","v":0.15588864942248731},0.16328898509037695,{"$f":"D28/D$26","v":0.14921652390633727},0.15942525451981368,0.1479731347752771,0.15905335081987459,null,{"$f":"I28/I$26","v":7.4121569807405724E-2},6.7030987182409726E-2,8.0793487598984595E-2]
[]
["Calculation of RBC After Covariance"]
["H0",{"$f":"IF($B$19=\"Yes\",AVERAGE(C24:G24),AVERAGE(D24:G24))","v":4657710234.6000004},{"$f":"C24","v":5192392682},{"$f":"D24","v":4782424393},{"$f":"E24","v":4487634571},{"$f":"F24","v":4332880131},{"$f":"G24","v":4493219396},null,{"$f":"IF($B$19=\"Yes\",AVERAGE(J24:K24),AVERAGE(K24))","v":335724340},{"$f":"J24","v":324883630},{"$f":"K24","v":346565050}]
["H1^2",{"$f":"IF($B$19=\"Yes\",AVERAGE(C25:G25)^2,AVERAGE(D25:G25)^2)","v":8.4136481154803761E+19},{"$f":"C25^2","v":1.275115952440554E+20},9.494433860259124E+19,7.3775133277507944E+19,6.915237774368061E+19,6.2756377105798185E+19,null,{"$f":"IF($B$19=\"Yes\",AVERAGE(J25:K25)^2,AVERAGE(K25)^2)","v":1.2664811381107348E+18},{"$f":"J25^2","v":1.0352461267979071E+18},1.5210052797964232E+18]
["H2^2",{"$f":"IF($B$19=\"Yes\",AVERAGE(C26:G26)^2,AVERAGE(D26:G26)^2)","v":1.707184047680807E+21},2.0993958506900229E+21,1.9393135668723885E+21,1.6461361998038025E+21,1.5044338195636581E+21,1.3968144217032905E+21,null,{"$f":"IF($B$19=\"Yes\",AVERAGE(J26:K26)^2,AVERAGE(K26)^2)","v":1.7557253076427286E+20},1.6505293190351307E+20,1.8641708583487957E+20]
["H3^2",{"$f":"IF($B$19=\"Yes\",AVERAGE(C27:G27)^2,AVERAGE(D27:G27)^2)","v":1.2057838425751513E+19},1.7637756086964314E+19,1.3154644662132099E+19,1.1614695895109497E+19,9.8794294831782011E+18,8.9063037444862966E+18,null,5.1234085307575174E+17,3.8417509814559718E+17,6.5892374655475712E+17]
["H4^2",{"$f":"IF($B$19=\"Yes\",AVERAGE(C28:G28)^2,AVERAGE(D28:G28)^2)","v":4.1486742221607199E+19},5.597680595901789E+19,4.3179923927435436E+19,4.1838875498049962E+19,3.2941156051550454E+19,3.5336567110733873E+19,null,9.6459673246498867E+17,7.4160811619089152E+17,1.216853865083668E+18]
["Risk Based Capital After Covariance",{"$f":"B39+SUM(B40:B43)^(1/2)*1.03","v":48898159991.021805},54595062632.783493,51877111521.540077,47862314133.585419,45743578699.330742,44435626961.729752,null,{"$f":"I39+SUM(I40:I43)^(1/2)*1.03","v":14089828847.809256},{"$f":"J39+SUM(J40:J43)^(1/2)*1.03","v":13643941084.806873},14537179319.007069]
[]
["Authorized Control Level",{"$f":"B44/2","v":24449079995.510902},27297531316.391747,25938555760.770039,23931157066.792709,22871789349.665371,22217813480.864876,null,{"$f":"I44/2","v":7044914423.9046278},6821970542.4034367,7268589659.5035343]
["ACL % of Revenue",{"$f":"B46/B56","v":3.5029674312779695E-2},{"$f":"C46/C56","v":3.3837981342457996E-2},3.5444858781453446E-2,3.4716661587408104E-2,3.5523141309025771E-2,3.5947070856342959E-2,null,{"$f":"I46/I56","v":3.2191571853645122E-2},{"$f":"J46/J56","v":3.3582457514536257E-2},3.0990040300924126E-2]
[]
["Relative Contribution to ACL"]
["H0",{"$f":"IF($B$19=\"Yes\",AVERAGE(C50:G50),AVERAGE(D50:G50))","v":9.537896406555009E-2},{"$f":"C39/C44","v":9.510736743586129E-2},{"$f":"D39/D44","v":9.2187561194772241E-2},9.3761337123709737E-2,9.4721057123223998E-2,0.1011174974501832,null,{"$f":"IF($B$19=\"Yes\",AVERAGE(J50:N50),AVERAGE(K50:N50))","v":2.3825739082248637E-2},{"$f":"J39/J44","v":2.3811567931920505E-2},{"$f":"K39/K44","v":2.3839910232576769E-2}]
["H1^2",{"$f":"IF($B$19=\"Yes\",AVERAGE(C51:G51),AVERAGE(D51:G51))","v":4.1065222841940453E-2},{"$f":"(1-C$50)*(C40/SUM(C$40:C$43))","v":5.0155704967220757E-2},4.1228337252163336E-2,3.7701139774581241E-2,3.8729230838256933E-2,3.7511701377479986E-2,null,{"$f":"IF($B$19=\"Yes\",AVERAGE(J51:N51),AVERAGE(K51:N51))","v":6.9329169680419338E-3},{"$f":"(1-J$50)*(J40/SUM(J$40:J$43))","v":6.0437255705270854E-3},7.8221083655567823E-3]
["H2^2",{"$f":"IF($B$19=\"Yes\",AVERAGE(C52:G52),AVERAGE(D52:G52))","v":0.83732341372012087},0.82578120597644367,0.84212155194821181,0.8412212652108072,0.842567769610583,0.83492527585455834,null,{"$f":"IF($B$19=\"Yes\",AVERAGE(J52:N52),AVERAGE(K52:N52))","v":0.96113190316930219},0.96357242902340157,0.95869137731520271]
["H3^2",{"$f":"IF($B$19=\"Yes\",AVERAGE(C53:G53),AVERAGE(D53:G53))","v":5.8883979040033445E-3},6.9376756591305053E-3,5.7122323936853528E-3,5.9354318172987735E-3,5.5330375829232472E-3,5.3236120669788401E-3,null,{"$f":"IF($B$19=\"Yes\",AVERAGE(J53:N53),AVERAGE(K53:N53))","v":2.8157304966054042E-3},2.2427988901575985E-3,3.3886621030532098E-3]
["H4^2",{"$f":"IF($B$19=\"Yes\",AVERAGE(C54:G54),AVERAGE(D54:G54))","v":2.0344001468385275E-2},2.2018045961343699E-2,1.8750317211167333E-2,2.1380826073603077E-2,1.8448904845012763E-2,2.1121913250799512E-2,null,{"$f":"IF($B$19=\"Yes\",AVERAGE(J54:N54),AVERAGE(K54:N54))","v":5.2937102838017166E-3},4.3294785839930695E-3,6.2579419836103628E-3]
[]
["Revenue",{"$f":"IF($B$19=\"Yes\",AVERAGE(C56:G56),AVERAGE(D56:G56))","v":697953391664.59998},806712759846,731800228651,689327716795,643856047265,618070205766,null,{"$f":"IF($B$19=\"Yes\",AVERAGE(J56:N56),AVERAGE(K56:N56))","v":218843443120.25},203140896983.20999,234545989257.29001]
[]
["Aggregate RBC%",{"$f":"IF($B$19=\"Yes\",AVERAGE(C58:G58),AVERAGE(D58:G58))","v":5.8739999999999997},6.72,5.48,6.26,5.26,5.65,null,{"$f":"IF($B$19=\"Yes\",AVERAGE(J58:K58),AVERAGE(K58:K58))","v":4.3611916172156286},4.0593406572191517,4.6630425772121056]
["Median RBC%",6.418000000000001,7.06,6.4,6.68,6.09,5.86,null,{"$f":"IF($B$19=\"Yes\",AVERAGE(J59:K59),AVERAGE(K59:K59))","v":4.1950000000000003},3.82,4.57]
[]
[]
["Source: NAIC. \"Aggregated Health Risk-Based Capital Data\" (2016-2020) Internet: https://content.naic.org/sites/default/files/inline-files/2020%20Health%20RBC%20Statistics_as%20of%202020-06-30.pdf"]

{"sheet":"Equity Premium","index":9,"n_rows":48,"n_cols":6,"rows_kept":48,"cut":false,"hidden":true,"merged":[]}
["Calculation of Equity Risk Premium"]
[]
["Sources: ","Annual Return and Trailing 12-Mon Return derived from Month-End Close, from Google Finance function in Google Sheets"]
[null,"Dividends reflects historical dividend payments, from Dividend Investor (Internet: https://www.dividendinvestor.com/dividend-history/)"]
[null,"For \"Equity Risk Premium\" proxy, data reflects  ERP T12m field (replaced with ERP T12m with COVID Adjustment where applicable), from Damodaran Online (Internet: http://people.stern.nyu.edu/adamodar/New_Home_Page/home.htm)"]
[]
["Period:","Jan-2011 through Dec-2021"]
[]
["Selected Time Period:",{"$f":"'User Parameters'!C27","v":"5-Year"}]
["Total Return (inc. Dividends)","No"]
[]
[null,"S&P 500 (Index)","Select Insurers (Stocks)","Utilities (Stocks)","Equity Risk Premium (A. Damodaran)"]
["Selected Return:",{"$f":"IF($B$10=\"Yes\",VLOOKUP($B$9,$A$23:B$25,B$16,FALSE),0)+VLOOKUP($B$9,$A$33:B$35,B$16,FALSE)","v":0.12606036725596867},{"$f":"IF($B$10=\"Yes\",VLOOKUP($B$9,$A$23:C$25,C$16,FALSE),0)+VLOOKUP($B$9,$A$33:C$35,C$16,FALSE)","v":0.15962362008747938},{"$f":"IF($B$10=\"Yes\",VLOOKUP($B$9,$A$23:D$25,D$16,FALSE),0)+VLOOKUP($B$9,$A$33:D$35,D$16,FALSE)","v":9.4752665689721058E-2},{"$f":"IF($B$10=\"Yes\",VLOOKUP($B$9,$A$23:E$25,E$16,FALSE),0)+VLOOKUP($B$9,$A$33:E$35,E$16,FALSE)","v":5.3313888888888897E-2}]
["Selected Beta",{"$f":"VLOOKUP($B$9,$A$28:B$30,B$16,FALSE)","v":1},{"$f":"VLOOKUP($B$9,$A$28:C$30,C$16,FALSE)","v":0.96817948486192729},{"$f":"VLOOKUP($B$9,$A$28:D$30,D$16,FALSE)","v":0.38223439074477483},1]
[]
[null,2,3,4,5]
["Annual Return"]
[{"$f":"F18&\"-Year\"","v":"10-Year"},0.14130263434568002,0.21319536680755566,9.2988721847399564E-2,5.5694696969696963E-2,10]
[{"$f":"F19&\"-Year\"","v":"5-Year"},0.16054830319644409,0.20467477245248775,0.11057427104196928,5.3313888888888897E-2,5]
[{"$f":"F20&\"-Year\"","v":"3-Year"},0.23845268741352643,0.20909315739207918,0.13034139524019056,5.1470833333333348E-2,3]
[]
["Annual Dividend Yield"]
[{"$f":"F23&\"-Year\"","v":"10-Year"},1.7888077488241123E-2,1.2803178414528585E-2,3.5904419145031528E-2,0,10]
[{"$f":"F24&\"-Year\"","v":"5-Year"},1.6473825296272199E-2,1.3065304789581655E-2,3.358701756213138E-2,0,5]
[{"$f":"F25&\"-Year\"","v":"3-Year"},1.4736936678250163E-2,1.2861947078304941E-2,3.1989174123882899E-2,0,3]
[]
["Beta"]
[{"$f":"F28&\"-Year\"","v":"10-Year"},1,0.85793203157371711,0.31615182999895275,1,10]
[{"$f":"F29&\"-Year\"","v":"5-Year"},1,0.96817948486192729,0.38223439074477483,1,5]
[{"$f":"F30&\"-Year\"","v":"3-Year"},1,0.86256853172936232,0.47995297711290286,1,3]
[]
["Twelve Month Trailing Return"]
[{"$f":"F33&\"-Year\"","v":"10-Year"},0.12231394089226051,0.21183533167267857,9.2833681549699579E-2,5.5694696969696963E-2,10]
[{"$f":"F34&\"-Year\"","v":"5-Year"},0.12606036725596867,0.15962362008747938,9.4752665689721058E-2,5.3313888888888897E-2,5]
[{"$f":"F35&\"-Year\"","v":"3-Year"},0.14443909366559957,0.16209952173509057,9.0670971133163497E-2,5.1470833333333348E-2,3]
[]
[]
["Tickers","SPY","CI","NEE"]
[null,null,"CVS","DUK"]
[null,null,"CNC","SO"]
[null,null,"ANTM","D"]
[null,null,"HUM","AEP"]
[null,null,"UNH","SRE"]
[null,null,null,"EXC"]
[null,null,null,"XEL"]
[null,null,null,"PEG"]
[]
["Note. For Equity Risk Premium, Annual Return reflects average Trailing 12-Month Return"]

{"sheet":"Tax Rates","index":10,"n_rows":69,"n_cols":5,"rows_kept":69,"cut":false,"hidden":true,"merged":[]}
["State Corporate Tax Rates"]
[]
["Source:","Tax Foundation. \"State Corporate Income Tax Rates and Brackets for 2021\" Internet: https://taxfoundation.org/state-corporate-tax-rates-2021/"]
[]
["Period",2021]
[]
["STATE","Rate (%)","Federal Tax Deduction","Top Bracket","Note"]
["Alabama",6.5000000000000002E-2,1,0]
["Alaska",9.4E-2,null,222000]
["Arizona",4.9000000000000002E-2,null,0]
["Arkansas",6.2E-2,null,100000]
["California",8.8400000000000006E-2,null,0]
["Colorado",4.5499999999999999E-2,null,0]
["Connecticut",7.4999999999999997E-2,null,0]
["Delaware",8.6999999999999994E-2,null,0,"a"]
["Florida",4.4580000000000002E-2,null,0,"b"]
["Georgia",5.7500000000000002E-2,null,0,"c"]
["Hawaii",6.4000000000000001E-2,null,100000]
["Idaho",6.9250000000000006E-2,null,0]
["Illinois",9.5000000000000001E-2,null,0,"d"]
["Indiana",5.2499999999999998E-2,null,0,"e"]
["Iowa",9.8000000000000004E-2,0.5,250000]
["Kansas",7.0000000000000007E-2,null,50000]
["Kentucky",0.05,null,0]
["Louisiana",0.08,1,200000]
["Maine",8.9300000000000004E-2,null,3500000]
["Maryland",8.2500000000000004E-2,null,0]
["Massachusetts",0.08,null,0]
["Michigan",0.06,null,0]
["Minnesota",9.8000000000000004E-2,null,0]
["Mississippi",0.05,null,10000,"f"]
["Missouri",0.04,0.5,0]
["Montana",6.7500000000000004E-2,null,0]
["Nebraska",7.8100000000000003E-2,null,100000]
["Nevada",0,null,0]
["New Hampshire",7.6999999999999999E-2,null,0,"a"]
["New Jersey",0.115,null,1000000]
["New Mexico",5.8999999999999997E-2,null,500000,"g"]
["New York",6.5000000000000002E-2,null,0]
["North Carolina",2.5000000000000001E-2,null,0]
["North Dakota",4.3099999999999999E-2,null,50000]
["Ohio",0,null,0]
["Oklahoma",0.06,null,0,"a"]
["Oregon",7.5999999999999998E-2,null,1000000]
["Pennsylvania",9.9900000000000003E-2,null,0,"a"]
["Rhode Island",7.0000000000000007E-2,null,0]
["South Carolina",0.05,null,0]
["South Dakota",0,null,0]
["Tennessee",6.5000000000000002E-2,null,0]
["Texas",0,null,0,"a"]
["Utah",4.9500000000000002E-2,null,0,"a"]
["Vermont",8.5000000000000006E-2,null,25000]
["Virginia",0.06,null,0]
["Washington",0,null,0]
["West Virginia",6.5000000000000002E-2,null,0,"a"]
["Wisconsin",7.9000000000000001E-2,null,0]
["Wyoming",0,null,0]
["District of Columbia",8.2500000000000004E-2,null,0]
["User-Defined",{"$f":"'User Parameters'!J36","v":0},"n/a","n/a","n/a"]
[]
["Specific Notes:"]
["(a) Nevada, Ohio, Texas, and Washington do not have a corporate income tax but do have a gross receipts tax with rates not strictly comparable to corporate income tax rates. See Table 18 for more information. Delaware, Oregon, and Tennessee have gross receipts taxes in addition to corporate income taxes, as do several states like Pennsylvania, Virginia, and West Virginia, which permit gross receipts taxes at the local (but not state) level."]
["(b) Florida's corporate income tax rate will return to 5.5% for tax years beginning on or after Jan. 1, 2022."]
["(c) Georgia's corporate income tax rate will revert to 6% on January 1, 2026."]
["(d) Illinois' rate includes two separate corporate income taxes, one at a 7% rate and one at a 2.5% rate. "]
["(e) Indiana's rate will change to 4.9% on July 1, 2021."]
["(f) Mississippi continues to phase out the 3 percent bracket by increasing the exemption by $1,000 a year. By the start of 2022, the 3% bracket will be fully eliminated."]
["(g) In New Jersey, the rates indicated apply to a corporation's entire net income rather than just income over the threshold. A temporary and retroactive surcharge is in effect from 2020 to 2023, bringing the rate to 11.5% for businesses with income over $1 million."]
["General note: In addition to regular income taxes, many states impose other taxes on corporations such as gross receipts taxes and capital stock taxes. Some states also impose an alternative minimum tax and special rates on financial institutions."]

{"sheet":"Treasury and Corporate Yields","index":11,"n_rows":144,"n_cols":13,"rows_kept":144,"cut":false,"hidden":true,"merged":[]}
["Calculation of Risk-Free Rate of Return and Proxy for Cost of Debt"]
[]
["Source: Federal Reserve Bank of St. Louis, Economic Research Division. ALFRED (Archival Federal Reserve Economic Data). Internet: https://alfred.stlouisfed.org"]
[]
["Selected Time Period:",{"$f":"'User Parameters'!C27","v":"5-Year"}]
["Most Recent Year",2021]
[]
[null,"3-Month Treasury","10-Year Treasury","20-Year Treasury","Corporate Aaa","Corporate Baa"]
["Selected:",{"$f":"VLOOKUP($B5,$A10:B12,2,FALSE)","v":1.0529508196721316E-2},{"$f":"VLOOKUP($B5,$A10:C12,3,FALSE)","v":1.9411475409836069E-2},{"$f":"VLOOKUP($B5,$A10:D12,4,FALSE)","v":2.278852459016394E-2},{"$f":"VLOOKUP($B5,$A10:E12,5,FALSE)","v":3.2429508196721309E-2},{"$f":"VLOOKUP($B5,$A10:F12,6,FALSE)","v":4.1129508196721315E-2}]
[{"$f":"G10&\"-Year\"","v":"10-Year"},{"$f":"AVERAGEIFS(FRED[Treasury 3-Mon],FRED[Observation Date],\">=\"&DATE($B$6-G10+1,1,1),FRED[Observation Date],\"<=\"&DATE($B$6,13,31))/100","v":5.8504132231404962E-3},{"$f":"AVERAGEIFS(FRED[Treasury 10-Yr],FRED[Observation Date],\">=\"&DATE($B$6-G10+1,1,1),FRED[Observation Date],\"<=\"&DATE($B$6,13,31))/100","v":2.0369421487603311E-2},{"$f":"AVERAGEIFS(FRED[Treasury 20-Yr],FRED[Observation Date],\">=\"&DATE($B$6-G10+1,1,1),FRED[Observation Date],\"<=\"&DATE($B$6,13,31))/100","v":2.4885950413223126E-2},{"$f":"AVERAGEIFS(FRED[Corporate Aaa],FRED[Observation Date],\">=\"&DATE($B$6-G10+1,1,1),FRED[Observation Date],\"<=\"&DATE($B$6,13,31))/100","v":3.5809917355371895E-2},{"$f":"AVERAGEIFS(FRED[Corporate Baa],FRED[Observation Date],\">=\"&DATE($B$6-G10+1,1,1),FRED[Observation Date],\"<=\"&DATE($B$6,13,31))/100","v":4.5138842975206608E-2},10]
[{"$f":"G11&\"-Year\"","v":"5-Year"},{"$f":"AVERAGEIFS(FRED[Treasury 3-Mon],FRED[Observation Date],\">=\"&DATE($B$6-G11+1,1,1),FRED[Observation Date],\"<=\"&DATE($B$6,13,31))/100","v":1.0529508196721316E-2},{"$f":"AVERAGEIFS(FRED[Treasury 10-Yr],FRED[Observation Date],\">=\"&DATE($B$6-G11+1,1,1),FRED[Observation Date],\"<=\"&DATE($B$6,13,31))/100","v":1.9411475409836069E-2},{"$f":"AVERAGEIFS(FRED[Treasury 20-Yr],FRED[Observation Date],\">=\"&DATE($B$6-G11+1,1,1),FRED[Observation Date],\"<=\"&DATE($B$6,13,31))/100","v":2.278852459016394E-2},{"$f":"AVERAGEIFS(FRED[Corporate Aaa],FRED[Observation Date],\">=\"&DATE($B$6-G11+1,1,1),FRED[Observation Date],\"<=\"&DATE($B$6,13,31))/100","v":3.2429508196721309E-2},{"$f":"AVERAGEIFS(FRED[Corporate Baa],FRED[Observation Date],\">=\"&DATE($B$6-G11+1,1,1),FRED[Observation Date],\"<=\"&DATE($B$6,13,31))/100","v":4.1129508196721315E-2},5]
[{"$f":"G12&\"-Year\"","v":"3-Year"},{"$f":"AVERAGEIFS(FRED[Treasury 3-Mon],FRED[Observation Date],\">=\"&DATE($B$6-G12+1,1,1),FRED[Observation Date],\"<=\"&DATE($B$6,13,31))/100","v":8.0513513513513491E-3},{"$f":"AVERAGEIFS(FRED[Treasury 10-Yr],FRED[Observation Date],\">=\"&DATE($B$6-G12+1,1,1),FRED[Observation Date],\"<=\"&DATE($B$6,13,31))/100","v":1.5008108108108105E-2},{"$f":"AVERAGEIFS(FRED[Treasury 20-Yr],FRED[Observation Date],\">=\"&DATE($B$6-G12+1,1,1),FRED[Observation Date],\"<=\"&DATE($B$6,13,31))/100","v":1.9178378378378384E-2},{"$f":"AVERAGEIFS(FRED[Corporate Aaa],FRED[Observation Date],\">=\"&DATE($B$6-G12+1,1,1),FRED[Observation Date],\"<=\"&DATE($B$6,13,31))/100","v":2.8578378378378389E-2},{"$f":"AVERAGEIFS(FRED[Corporate Baa],FRED[Observation Date],\">=\"&DATE($B$6-G12+1,1,1),FRED[Observation Date],\"<=\"&DATE($B$6,13,31))/100","v":3.7840540540540542E-2},3]
[]
["Monthly Observation Data:",null,null,null,null,null,null,null,null,null,null,null,3]
[]
["Treasury 3-Mon","3-Month Treasury Bill Secondary Market Rate, Percent, Monthly, Not Seasonally Adjusted"]
["Treasury 10-Yr","Market Yield on U.S. Treasury Securities at 10-Year Constant Maturity Vintage: 2022-02-01, Percent, Monthly, Not Seasonally Adjusted"]
["Treasury 20-Yr","Market Yield on U.S. Treasury Securities at 20-Year Constant Maturity Vintage: 2022-02-01, Percent, Monthly, Not Seasonally Adjusted"]
["Corporate Aaa","Moody's Seasoned Aaa Corporate Bond Yield Vintage: 2022-02-01, Percent, Monthly, Not Seasonally Adjusted"]
["Corporate Baa","Moody's Seasoned Baa Corporate Bond Yield Vintage: 2022-02-01, Percent, Monthly, Not Seasonally Adjusted"]
[]
[]
["Observation Date","Treasury 3-Mon","Treasury 10-Yr","Treasury 20-Yr","Corporate Aaa","Corporate Baa"]
["2012-01-01",0.03,1.97,2.7,3.85,5.23]
["2012-02-01",0.09,1.97,2.75,3.85,5.14]
["2012-03-01",0.08,2.17,2.94,3.99,5.23]
["2012-04-01",0.08,2.0499999999999998,2.82,3.96,5.19]
["2012-05-01",0.09,1.8,2.5299999999999998,3.8,5.07]
["2012-06-01",0.09,1.62,2.31,3.64,5.0199999999999996]
["2012-07-01",0.1,1.53,2.2200000000000002,3.4,4.87]
["2012-08-01",0.1,1.68,2.4,3.48,4.91]
["2012-09-01",0.11,1.72,2.4900000000000002,3.49,4.84]
["2012-10-01",0.1,1.75,2.5099999999999998,3.47,4.58]
["2012-11-01",0.09,1.65,2.39,3.5,4.51]
["2012-12-01",7.0000000000000007E-2,1.72,2.4700000000000002,3.65,4.63]
["2013-01-01",7.0000000000000007E-2,1.91,2.68,3.8,4.7300000000000004]
["2013-02-01",0.1,1.98,2.78,3.9,4.8499999999999996]
["2013-03-01",0.09,1.96,2.78,3.93,4.8499999999999996]
["2013-04-01",0.06,1.76,2.5499999999999998,3.73,4.59]
["2013-05-01",0.04,1.93,2.73,3.89,4.7300000000000004]
["2013-06-01",0.05,2.2999999999999998,3.07,4.2699999999999996,5.19]
["2013-07-01",0.04,2.58,3.31,4.34,5.32]
["2013-08-01",0.04,2.74,3.49,4.54,5.42]
["2013-09-01",0.02,2.81,3.53,4.6399999999999997,5.47]
["2013-10-01",0.05,2.62,3.38,4.53,5.31]
["2013-11-01",7.0000000000000007E-2,2.72,3.5,4.63,5.38]
["2013-12-01",7.0000000000000007E-2,2.9,3.63,4.62,5.38]
["2014-01-01",0.04,2.86,3.52,4.49,5.19]
["2014-02-01",0.05,2.71,3.38,4.45,5.0999999999999996]
["2014-03-01",0.05,2.72,3.35,4.38,5.0599999999999996]
["2014-04-01",0.03,2.71,3.27,4.24,4.9000000000000004]
["2014-05-01",0.03,2.56,3.12,4.16,4.76]
["2014-06-01",0.04,2.6,3.15,4.25,4.8]
["2014-07-01",0.03,2.54,3.07,4.16,4.7300000000000004]
["2014-08-01",0.03,2.42,2.94,4.08,4.6900000000000004]
["2014-09-01",0.02,2.5299999999999998,3.01,4.1100000000000003,4.8]
["2014-10-01",0.02,2.2999999999999998,2.77,3.92,4.6900000000000004]
["2014-11-01",0.02,2.33,2.76,3.92,4.79]
["2014-12-01",0.03,2.21,2.5499999999999998,3.79,4.74]
["2015-01-01",0.03,1.88,2.2000000000000002,3.46,4.45]
["2015-02-01",0.02,1.98,2.34,3.61,4.51]
["2015-03-01",0.03,2.04,2.41,3.64,4.54]
["2015-04-01",0.02,1.94,2.33,3.52,4.4800000000000004]
["2015-05-01",0.02,2.2000000000000002,2.69,3.98,4.8899999999999997]
["2015-06-01",0.02,2.36,2.85,4.1900000000000004,5.13]
["2015-07-01",0.03,2.3199999999999998,2.77,4.1500000000000004,5.2]
["2015-08-01",7.0000000000000007E-2,2.17,2.5499999999999998,4.04,5.19]
["2015-09-01",0.02,2.17,2.62,4.07,5.34]
["2015-10-01",0.02,2.0699999999999998,2.5,3.95,5.34]
["2015-11-01",0.12,2.2599999999999998,2.69,4.0599999999999996,5.46]
["2015-12-01",0.23,2.2400000000000002,2.61,3.97,5.46]
["2016-01-01",0.26,2.09,2.4900000000000002,4,5.45]
["2016-02-01",0.31,1.78,2.2000000000000002,3.96,5.34]
["2016-03-01",0.28999999999999998,1.89,2.2799999999999998,3.82,5.13]
["2016-04-01",0.23,1.81,2.21,3.62,4.79]
["2016-05-01",0.27,1.81,2.2200000000000002,3.65,4.68]
["2016-06-01",0.27,1.64,2.02,3.5,4.53]
["2016-07-01",0.3,1.5,1.82,3.28,4.22]
["2016-08-01",0.3,1.56,1.89,3.32,4.24]
["2016-09-01",0.28999999999999998,1.63,2.02,3.41,4.3099999999999996]
["2016-10-01",0.33,1.76,2.17,3.51,4.38]
["2016-11-01",0.45,2.14,2.54,3.86,4.71]
["2016-12-01",0.51,2.4900000000000002,2.84,4.0599999999999996,4.83]
["2017-01-01",0.51,2.4300000000000002,2.75,3.92,4.66]
["2017-02-01",0.52,2.42,2.76,3.95,4.6399999999999997]
["2017-03-01",0.74,2.48,2.83,4.01,4.68]
["2017-04-01",0.8,2.2999999999999998,2.67,3.87,4.57]
["2017-05-01",0.89,2.2999999999999998,2.7,3.85,4.55]
["2017-06-01",0.98,2.19,2.54,3.68,4.37]
["2017-07-01",1.07,2.3199999999999998,2.65,3.7,4.3899999999999997]
["2017-08-01",1.01,2.21,2.5499999999999998,3.63,4.3099999999999996]
["2017-09-01",1.03,2.2000000000000002,2.5299999999999998,3.63,4.3]
["2017-10-01",1.07,2.36,2.65,3.6,4.32]
["2017-11-01",1.23,2.35,2.6,3.57,4.2699999999999996]
["2017-12-01",1.32,2.4,2.6,3.51,4.22]
["2018-01-01",1.41,2.58,2.73,3.55,4.26]
["2018-02-01",1.57,2.86,3.02,3.82,4.51]
["2018-03-01",1.7,2.84,2.97,3.87,4.6399999999999997]
["2018-04-01",1.76,2.87,2.96,3.85,4.67]
["2018-05-01",1.86,2.98,3.05,4,4.83]
["2018-06-01",1.9,2.91,2.98,3.96,4.83]
["2018-07-01",1.96,2.89,2.94,3.87,4.79]
["2018-08-01",2.0299999999999998,2.89,2.97,3.88,4.7699999999999996]
["2018-09-01",2.13,3,3.08,3.98,4.88]
["2018-10-01",2.25,3.15,3.27,4.1399999999999997,5.07]
["2018-11-01",2.33,3.12,3.27,4.22,5.22]
["2018-12-01",2.37,2.83,2.98,4.0199999999999996,5.13]
["2019-01-01",2.37,2.71,2.89,3.93,5.12]
["2019-02-01",2.39,2.68,2.87,3.79,4.95]
["2019-03-01",2.4,2.57,2.8,3.77,4.84]
["2019-04-01",2.38,2.5299999999999998,2.76,3.69,4.7]
["2019-05-01",2.35,2.4,2.63,3.67,4.63]
["2019-06-01",2.17,2.0699999999999998,2.36,3.42,4.46]
["2019-07-01",2.1,2.06,2.36,3.29,4.28]
["2019-08-01",1.95,1.63,1.91,2.98,3.87]
["2019-09-01",1.89,1.7,1.97,3.03,3.91]
["2019-10-01",1.65,1.71,2,3.01,3.92]
["2019-11-01",1.54,1.81,2.13,3.06,3.94]
["2019-12-01",1.54,1.86,2.16,3.01,3.88]
["2020-01-01",1.52,1.76,2.0699999999999998,2.94,3.77]
["2020-02-01",1.52,1.5,1.81,2.78,3.61]
["2020-03-01",0.28999999999999998,0.87,1.26,3.02,4.29]
["2020-04-01",0.14000000000000001,0.66,1.06,2.4300000000000002,4.13]
["2020-05-01",0.13,0.67,1.1200000000000001,2.5,3.95]
["2020-06-01",0.16,0.73,1.27,2.44,3.64]
["2020-07-01",0.13,0.62,1.0900000000000001,2.14,3.31]
["2020-08-01",0.1,0.65,1.1399999999999999,2.25,3.27]
["2020-09-01",0.11,0.68,1.21,2.31,3.36]
["2020-10-01",0.1,0.79,1.34,2.35,3.44]
["2020-11-01",0.09,0.87,1.4,2.2999999999999998,3.3]
["2020-12-01",0.09,0.93,1.47,2.2599999999999998,3.16]
["2021-01-01",0.08,1.08,1.63,2.4500000000000002,3.24]
["2021-02-01",0.04,1.26,1.88,2.7,3.42]
["2021-03-01",0.03,1.61,2.2400000000000002,3.04,3.74]
["2021-04-01",0.02,1.64,2.2000000000000002,2.9,3.6]
["2021-05-01",0.02,1.62,2.2200000000000002,2.96,3.62]
["2021-06-01",0.04,1.52,2.09,2.79,3.44]
["2021-07-01",0.05,1.32,1.87,2.57,3.24]
["2021-08-01",0.05,1.28,1.83,2.5499999999999998,3.24]
["2021-09-01",0.04,1.37,1.87,2.5299999999999998,3.23]
["2021-10-01",0.05,1.58,2.0299999999999998,2.68,3.35]
["2021-11-01",0.05,1.56,1.97,2.62,3.28]
["2021-12-01",0.06,1.47,1.9,2.65,3.3]
["2022-01-01",0.15,1.76,2.15,2.93,3.58]

{"sheet":"Macro Populated Cells","index":12,"n_rows":17,"n_cols":6,"rows_kept":17,"cut":false,"hidden":true,"merged":[[3,1,3,5],[15,1,15,5]]}
["Macro Populated Cells"]
[]
[]
[null,"Underwriting Margin Cells"]
[null,"Underwriting Margin Components"]
[null,"Cost of Capital for:"]
[null,"Target Capital",null,null,1.1996292413644723E-2]
[null,"Withholds Payment Delay",null,null,0]
[null,"Premium Payment Delay",null,null,0]
[null,"Claims Delay",null,null,0]
[null,"Total COC",null,null,null,{"$f":"SUM(E7:E10)","v":1.1996292413644723E-2}]
[null,"Risk Margin",null,null,null,1.9999389648437498E-2]
[null,"Total Underwriting Margin",null,null,null,{"$f":"SUM(F11:F12)","v":3.1995682062082219E-2}]
[]
[]
[null,"Initial Curve Storage"]
[null,"Saving the Initial curve",null,"MCO Size Curve"]